Forum Flightgear France

Une communauté prend son envol

Vous n'êtes pas identifié(e).

Annonce

Futur nouvel inscrit, tu dois au préalable lire l'intégralité des 10 articles des règles, s'il te plaît. Tout nouveau compte qui ne respecte pas les règles sera supprimé par l'administration.

#26 25/09/2016 8:14:22

Silveraire40
Membre
Inscription : 2/05/2016
Messages : 165

Re : Terragear

Bonjour,
J'avais bien oublié de finir le chargement c'est fait. J'ai redemandé le chargement de Terragear mais j'ai toujours les mêmes erreurs signalées.
Un essai de TerraGUI jusqu’à l-onglet Airport  message :  FILE NO FOUND Unable to locate executable at /home/...../install/terragear/bin/bin/genapts850
Pas de teragear dans install  . Vue que je suis néophite avec Linux  peut qu'apres ./d&c terragear  il fallait l'installer si c'est le cas peut tu me donner la formule d'installation.


FG2016 1-1  W10  ACER Aspire X1430 - AMD E-350 dual-core - AMD Radéon HD6300   4GB DDR3 Memory

Hors ligne

#27 25/09/2016 9:30:12

ctesc356
Membre
Inscription : 18/05/2010
Messages : 2 229

Re : Terragear

Bonjour,
Terrageargui ne donnera rien tant que terragear n'est pas fonctionnel.

Il cherche un fichier "/usr/lib/x86_64-linux-gnu/libCGAL_Qt5.so.11.0.1"
Je n'ai pas ce fichier et ça fonctionne!?

On va essayer autre chose, tu vas télécharger mes sources de simgear et terragear ici : http://www.mediafire.com/download/sap4d … src.tar.gz
Décompresses le .tar.gz dans ton /home.

cd terragear_src

pour te rendre dans le dossier, il contient aussi d&c.
On va compiler simgear et terragear sans télécharger les sources et séparément pour plus de visibilité :

./download_and_compile.sh -j4 -an -pn -dn SIMGEAR

si ça passe:

./download_and_compile.sh -j4 -an -pn -dn TERRAGEAR

peut qu'apres ./d&c terragear  il fallait l'installer si c'est le cas peut tu me donner la formule d'installation.

Il n'y a rien a installer après d&c.
Les binaires sont dans .../install/terragear/bin (voir la liste dans un de mes posts plus haut: #17 du 20/09) et  .../install/terrageargui/bin
En utilisant terrageargui c'est lui qui lance les différents modules de terragear.

Dernière modification par ctesc356 (25/09/2016 11:14:24)


Intel i5 3570 3.4Mhz, Nvidia GTX 660, 8Go Ram, Linux Mint

Hors ligne

#28 25/09/2016 11:34:21

Silveraire40
Membre
Inscription : 2/05/2016
Messages : 165

Re : Terragear

Bonjour,
j'ai fini l'installation degdal-2.0.1,enregistrement correct.
J'ai recharger Terragear  avec  L&C  mais toujours les mêmes erreurs signalées. Je n'ai pas de dossier terragear dans "install"  faut-il faire une manip pour l'installer ce qui c’était fait automatiquement avec terrageargui
si c'est le cas pourrais tu me donner la formule. Je suis complètement novice sous linux il me faut un peu de temps pour l'assimiler.
A bientot


FG2016 1-1  W10  ACER Aspire X1430 - AMD E-350 dual-core - AMD Radéon HD6300   4GB DDR3 Memory

Hors ligne

#29 25/09/2016 23:26:50

ctesc356
Membre
Inscription : 18/05/2010
Messages : 2 229

Re : Terragear

Il n'y a pas de dossier "terragear" dans "install" tant que la compilation de terragear échoue.
As tu essayé avec mes sources?
Il est impératif que simgear soit compilé avant terragear


Intel i5 3570 3.4Mhz, Nvidia GTX 660, 8Go Ram, Linux Mint

Hors ligne

#30 26/09/2016 9:04:38

Silveraire40
Membre
Inscription : 2/05/2016
Messages : 165

Re : Terragear

Bonjour
Je viens de suivre a la lettre ton procéde et j'ai toujours les mêmes erreurs sur TERRAGEAR ????


FG2016 1-1  W10  ACER Aspire X1430 - AMD E-350 dual-core - AMD Radéon HD6300   4GB DDR3 Memory

Hors ligne

#31 26/09/2016 9:37:15

ctesc356
Membre
Inscription : 18/05/2010
Messages : 2 229

Re : Terragear

Tu peux nous montrer ton "compilation_log.txt" en entier?


Intel i5 3570 3.4Mhz, Nvidia GTX 660, 8Go Ram, Linux Mint

Hors ligne

#32 26/09/2016 9:55:56

Silveraire40
Membre
Inscription : 2/05/2016
Messages : 165

Re : Terragear

Le voici

    /home/caroline/download_and_compile.sh TERRAGEAR
VERSION=2.33
APT_GET_UPDATE=y
DOWNLOAD_PACKAGES=y
COMPILE=y
RECONFIGURE=y
DOWNLOAD=y
JOPTION=
OOPTION=
DEBUG=
***********************************
DIRECTORY= /home/caroline
***********************************
****************************************
*************** TERRAGEAR **************
****************************************
-- The C compiler identification is GNU 5.4.0
-- The CXX compiler identification is GNU 5.4.0
-- Check for working C compiler: /usr/bin/cc
-- Check for working C compiler: /usr/bin/cc -- works
-- Detecting C compiler ABI info
-- Detecting C compiler ABI info - done
-- Detecting C compile features
-- Detecting C compile features - done
-- Check for working CXX compiler: /usr/bin/c++
-- Check for working CXX compiler: /usr/bin/c++ -- works
-- Detecting CXX compiler ABI info
-- Detecting CXX compiler ABI info - done
-- Detecting CXX compile features
-- Detecting CXX compile features - done
-- Looking for pthread.h
-- Looking for pthread.h - found
-- Looking for pthread_create
-- Looking for pthread_create - not found
-- Looking for pthread_create in pthreads
-- Looking for pthread_create in pthreads - not found
-- Looking for pthread_create in pthread
-- Looking for pthread_create in pthread - found
-- Found Threads: TRUE  
-- Boost version: 1.58.0
-- Found the following Boost libraries:
--   system
--   thread
--   chrono
--   date_time
--   atomic
-- Found ZLIB: /usr/lib/x86_64-linux-gnu/libz.so (found version "1.2.8") 
-- SimGear include directory: /home/caroline/install/simgear/include
-- found SimGear version: 2016.4.0 (needed 3.1.0 or higher)
-- looking for static SimGear libraries
-- Looking for clock_gettime in rt
-- Looking for clock_gettime in rt - found
-- found SimGear libraries
-- Performing Test SIMGEAR_COMPILE_TEST
-- Performing Test SIMGEAR_COMPILE_TEST - Success
-- Found SimGear: /home/caroline/install/simgear/lib/libSimGearCore.a (Required is at least version "3.1.0") 
-- Found GDAL: /usr/local/lib/libgdal.so (Required is at least version "2.0.0") 
-- Found TIFF: /usr/lib/x86_64-linux-gnu/libtiff.so (found version "4.0.6") 
CMake Error at /usr/lib/x86_64-linux-gnu/cmake/CGAL/CGALExports.cmake:83 (message):
  The imported target "CGAL::CGAL_Qt5" references the file

     "/usr/lib/x86_64-linux-gnu/libCGAL_Qt5.so.11.0.1"

  but this file does not exist.  Possible reasons include:

  * The file was deleted, renamed, or moved to another location.

  * An install or uninstall procedure did not complete successfully.

  * The installation package was faulty and contained

     "/usr/lib/x86_64-linux-gnu/cmake/CGAL/CGALExports.cmake"

  but not all the files it references.

Call Stack (most recent call first):
  /usr/lib/x86_64-linux-gnu/cmake/CGAL/CGALConfig.cmake:12 (include)
  CMakeLists.txt:101 (find_package)


-- Configuring incomplete, errors occurred!
See also "/home/caroline/build/terragear/CMakeFiles/CMakeOutput.log".
See also "/home/caroline/build/terragear/CMakeFiles/CMakeError.log".
MAKE terragear
make: *** No targets specified and no makefile found.  Stop.
INSTALL terragear
make: *** No rule to make target 'install'.  Stop.
***********************************   

FG2016 1-1  W10  ACER Aspire X1430 - AMD E-350 dual-core - AMD Radéon HD6300   4GB DDR3 Memory

Hors ligne

#33 26/09/2016 12:04:34

f-toro
Administrateur
Lieu : LFLA
Inscription : 16/12/2007
Messages : 2 203

Re : Terragear

Sous réserve de dire des âneries, car je n'ai pas parfaitement suivi et de plus mon poste Linux n'est pas disponible (problème d'installation intempestive d'un pilote de carte graphique inadapté qu'il faut que je réussisse à corriger).

Mais quel est l'intérêt pour ma gouverne de compiler gdal par exemple ?

A ma connaissance, toujours sauf erreur, l'installation des paquets système libcgal-dev et libgdal-dev doit être suffisante pour compiler TG ?


André. anciennement taureau89_9
Debian Testing Amd64. CM Sabertooth 990FX, FX8350, 32 Go Ram DDR3 1866 Mhz, GTX 750ti 2Go, DD 2To Sata 3, THRUSTMASTER T.Flight StickX, FG 2017.4.0 Git.

Hors ligne

#34 26/09/2016 14:02:05

ctesc356
Membre
Inscription : 18/05/2010
Messages : 2 229

Re : Terragear

@Silveraire
Il y a un souci wink cette compilation n'a pas été faite avec mes sources.

-- found SimGear version: 2016.4.0 (needed 3.1.0 or higher)
...
...
-- Found SimGear: /home/caroline/install/simgear/lib/libSimGearCore.a (Required is at least version "3.1.0")

mes sources fournissent simgear 3.4.1
Si tu suis à la lettre ma procédure il trouvera simgear dans " /home/caroline/terragear_src/install/simgear/lib/libSimGearCore.a
Il faut lancer d&c dans le dossier "terragear_src" (/home/caroline /terragear_src). Si le nom de dossier ne te convient pas tu peux bien-sûr le changer wink
Ici avec simgear 2016. ... ça foire aussi, c'est pourquoi je te mets à disposition mes sources.
Pour éviter tout équivoque supprimes tout ce que tu as de simgear et terragear dans /home/caroline (sauf "terragear_src" of course wink )

@f-toro: depuis quelque-temps terragear à besoin de gdal2, les paquets dispo sont avec gdal1, voilà wink
Apparemment on ne trouve/trouvait pas de paquets gdal-2, j'ai suivi bêtement ce que d'autres on fait : https://forum.flightgear.org/viewtopic. … v2#p271805 et ça fonctionne.
Je pense que ça sera adapté d'ici peu, ça l'est peut-être déjà sur certaines config (debian testing?)

Dernière modification par ctesc356 (26/09/2016 16:03:09)


Intel i5 3570 3.4Mhz, Nvidia GTX 660, 8Go Ram, Linux Mint

Hors ligne

#35 26/09/2016 17:15:06

f-toro
Administrateur
Lieu : LFLA
Inscription : 16/12/2007
Messages : 2 203

Re : Terragear

ctesc356 a écrit :

depuis quelque-temps terragear à besoin de gdal2, les paquets dispo sont avec gdal1, voilà wink
Apparemment on ne trouve/trouvait pas de paquets gdal-2, j'ai suivi bêtement ce que d'autres on fait : https://forum.flightgear.org/viewtopic. … v2#p271805 et ça fonctionne.
Je pense que ça sera adapté d'ici peu, ça l'est peut-être déjà sur certaines config (debian testing?)

Oui je viens de vérifier, testing est en gdal2.

C'est l'avantage que j'ai toujours trouvé à une testing, avoir des paquets plus récents, alors que la compilation ne passe pas en stable ou avec des distributions dérivées.
Par contre il faut faire attention, je viens justement de me faire piéger.
J'ai accepté sans sourciller une mise à jour dans laquelle il y avait le driver de ma carte graphique.
Or celui-ci ne semble pas compatible avec ma carte, les matériels vieillissent vite... (l'affichage saute).
Il faut que je revienne au dernier legacy, il me suffira bien jusqu'au jour où je changerai (CM, proc, CG...).
Mais là c'est clairement de ma faute, j'aurais du aller voir d'abord dans les infos du paquet la compatibilité avec la CG.


André. anciennement taureau89_9
Debian Testing Amd64. CM Sabertooth 990FX, FX8350, 32 Go Ram DDR3 1866 Mhz, GTX 750ti 2Go, DD 2To Sata 3, THRUSTMASTER T.Flight StickX, FG 2017.4.0 Git.

Hors ligne

#36 26/09/2016 18:05:57

Silveraire40
Membre
Inscription : 2/05/2016
Messages : 165

Re : Terragear

Re bonjour,
Apres avoir effacé tout les fichier SIMGEAR etTERRAGEAR j"ai recommencé la procedure il me semble  bien que sont tes sources cette fois,
mais toujour au finalL

caroline@caroline-Vostro-1500 ~/terragear_src $  ./download_and_compile.sh -j4 -an -dn TERRAGEAR
**************************************
*                                    *
* Warning, the compilation process   *
* is going to use 12 or more Gbytes  *
* of space and at least a couple of  *
* hours to download and build FG.    *
*                                    *
* Please, be patient ......          *
*                                    *
**************************************
Asking password for apt-get operations...
[sudo] password for caroline: 
Lecture des listes de paquets... Fait
Construction de l'arbre des dépendances       
Lecture des informations d'état... Fait
build-essential is already the newest version (12.1ubuntu2).
git is already the newest version (1:2.7.4-0ubuntu1).
libboost-dev is already the newest version (1.58.0.1ubuntu1).
libbz2-dev is already the newest version (1.0.6-8).
libdbus-1-dev is already the newest version (1.10.6-1ubuntu3).
libjpeg-dev is already the newest version (8c-2ubuntu8).
libpng12-dev is already the newest version (1.2.54-1ubuntu1).
libqt4-dev is already the newest version (4:4.8.7+dfsg-5ubuntu2).
libqt5multimedia5-plugins is already the newest version (5.5.1-4ubuntu2).
libtiff5-dev is already the newest version (4.0.6-1).
libxft-dev is already the newest version (2.3.2-1).
libxi-dev is already the newest version (2:1.7.6-1).
libxinerama-dev is already the newest version (2:1.1.3-1).
libxmu-dev is already the newest version (2:1.1.2-2).
python-tk is already the newest version (2.7.11-2).
zlib1g-dev is already the newest version (1:1.2.8.dfsg-2ubuntu4).
fluid is already the newest version (1.3.3-7).
freeglut3-dev is already the newest version (2.8.1-2).
libcgal-dev is already the newest version (4.7-4).
libfltk1.3-dev is already the newest version (1.3.3-7).
libgdal-dev is already the newest version (1.11.3+dfsg-3build2).
libopenal-dev is already the newest version (1:1.16.0-3).
libopenscenegraph-dev is already the newest version (3.2.1-7ubuntu4).
libplib-dev is already the newest version (1.8.5-7).
python3-pyqt5 is already the newest version (5.5.1+dfsg-3ubuntu4).
python3-pyqt5.qtmultimedia is already the newest version (5.5.1+dfsg-3ubuntu4).
cmake is already the newest version (3.5.1-1ubuntu2).
libudev-dev is already the newest version (229-4ubuntu8).
qt5-default is already the newest version (5.5.1+dfsg-16ubuntu7.1).
0 mis à jour, 0 nouvellement installés, 0 à enlever et 362 non mis à jour.
****************************************
*************** TERRAGEAR **************
****************************************
-- The C compiler identification is GNU 5.4.0
-- The CXX compiler identification is GNU 5.4.0
-- Check for working C compiler: /usr/bin/cc
-- Check for working C compiler: /usr/bin/cc -- works
-- Detecting C compiler ABI info
-- Detecting C compiler ABI info - done
-- Detecting C compile features
-- Detecting C compile features - done
-- Check for working CXX compiler: /usr/bin/c++
-- Check for working CXX compiler: /usr/bin/c++ -- works
-- Detecting CXX compiler ABI info
-- Detecting CXX compiler ABI info - done
-- Detecting CXX compile features
-- Detecting CXX compile features - done
-- Looking for pthread.h
-- Looking for pthread.h - found
-- Looking for pthread_create
-- Looking for pthread_create - not found
-- Looking for pthread_create in pthreads
-- Looking for pthread_create in pthreads - not found
-- Looking for pthread_create in pthread
-- Looking for pthread_create in pthread - found
-- Found Threads: TRUE  
-- Boost version: 1.58.0
-- Found the following Boost libraries:
--   system
--   thread
--   chrono
--   date_time
--   atomic
-- Found ZLIB: /usr/lib/x86_64-linux-gnu/libz.so (found version "1.2.8") 
-- SimGear include directory: /home/caroline/terragear_src/install/simgear/include
-- found SimGear version: 3.4.1 (needed 3.1.0 or higher)
-- looking for static SimGear libraries
-- Looking for clock_gettime in rt
-- Looking for clock_gettime in rt - found
-- found SimGear libraries
-- Performing Test SIMGEAR_COMPILE_TEST
-- Performing Test SIMGEAR_COMPILE_TEST - Success
-- Found SimGear: /home/caroline/terragear_src/install/simgear/lib/libSimGearCore.a (Required is at least version "3.1.0") 
-- Found GDAL: /usr/local/lib/libgdal.so (Required is at least version "2.0.0") 
-- Found TIFF: /usr/lib/x86_64-linux-gnu/libtiff.so (found version "4.0.6") 
CMake Error at /usr/lib/x86_64-linux-gnu/cmake/CGAL/CGALExports.cmake:83 (message):
  The imported target "CGAL::CGAL_Qt5" references the file

     "/usr/lib/x86_64-linux-gnu/libCGAL_Qt5.so.11.0.1"

  but this file does not exist.  Possible reasons include:

  * The file was deleted, renamed, or moved to another location.

  * An install or uninstall procedure did not complete successfully.

  * The installation package was faulty and contained

     "/usr/lib/x86_64-linux-gnu/cmake/CGAL/CGALExports.cmake"

  but not all the files it references.

Call Stack (most recent call first):
  /usr/lib/x86_64-linux-gnu/cmake/CGAL/CGALConfig.cmake:12 (include)
  CMakeLists.txt:101 (find_package)


-- Configuring incomplete, errors occurred!
See also "/home/caroline/terragear_src/build/terragear/CMakeFiles/CMakeOutput.log".
See also "/home/caroline/terragear_src/build/terragear/CMakeFiles/CMakeError.log".
make: *** No targets specified and no makefile found.  Stop.
make: *** No rule to make target 'install'.  Stop.

download_and_compile.sh has finished to work
  

Je ce dossier CMakeError c'est peut etre utile

 /usr/bin/make -f CMakeFiles/cmTC_19d66.dir/build.make CMakeFiles/cmTC_19d66.dir/bDetermining if the pthread_create exist failed with the following output:
Change Dir: /home/caroline/terragear_src/build/terragear/CMakeFiles/CMakeTmp

Run Build Command:"/usr/bin/make" "cmTC_19d66/fast"
uild
make[1]: Entering directory '/home/caroline/terragear_src/build/terragear/CMakeFiles/CMakeTmp'
Building C object CMakeFiles/cmTC_19d66.dir/CheckSymbolExists.c.o
/usr/bin/cc     -o CMakeFiles/cmTC_19d66.dir/CheckSymbolExists.c.o   -c /home/caroline/terragear_src/build/terragear/CMakeFiles/CMakeTmp/CheckSymbolExists.c
Linking C executable cmTC_19d66
/usr/bin/cmake -E cmake_link_script CMakeFiles/cmTC_19d66.dir/link.txt --verbose=1
/usr/bin/cc       CMakeFiles/cmTC_19d66.dir/CheckSymbolExists.c.o  -o cmTC_19d66 -rdynamic 
CMakeFiles/cmTC_19d66.dir/CheckSymbolExists.c.o: In function `main':
CheckSymbolExists.c:(.text+0x16): undefined reference to `pthread_create'
collect2: error: ld returned 1 exit status
CMakeFiles/cmTC_19d66.dir/build.make:97: recipe for target 'cmTC_19d66' failed
make[1]: *** [cmTC_19d66] Error 1
make[1]: Leaving directory '/home/caroline/terragear_src/build/terragear/CMakeFiles/CMakeTmp'
Makefile:126: recipe for target 'cmTC_19d66/fast' failed
make: *** [cmTC_19d66/fast] Error 2

File /home/caroline/terragear_src/build/terragear/CMakeFiles/CMakeTmp/CheckSymbolExists.c:
/* */
#include <pthread.h>

int main(int argc, char** argv)
{
  (void)argv;
#ifndef pthread_create
  return ((int*)(&pthread_create))[argc];
#else
  (void)argc;
  return 0;
#endif
}

Determining if the function pthread_create exists in the pthreads failed with the following output:
Change Dir: /home/caroline/terragear_src/build/terragear/CMakeFiles/CMakeTmp

Run Build Command:"/usr/bin/make" "cmTC_1e557/fast"
/usr/bin/make -f CMakeFiles/cmTC_1e557.dir/build.make CMakeFiles/cmTC_1e557.dir/build
make[1]: Entering directory '/home/caroline/terragear_src/build/terragear/CMakeFiles/CMakeTmp'
Building C object CMakeFiles/cmTC_1e557.dir/CheckFunctionExists.c.o
/usr/bin/cc    -DCHECK_FUNCTION_EXISTS=pthread_create   -o CMakeFiles/cmTC_1e557.dir/CheckFunctionExists.c.o   -c /usr/share/cmake-3.5/Modules/CheckFunctionExists.c
Linking C executable cmTC_1e557
/usr/bin/cmake -E cmake_link_script CMakeFiles/cmTC_1e557.dir/link.txt --verbose=1
/usr/bin/cc   -DCHECK_FUNCTION_EXISTS=pthread_create    CMakeFiles/cmTC_1e557.dir/CheckFunctionExists.c.o  -o cmTC_1e557 -rdynamic -lpthreads 
/usr/bin/ld: cannot find -lpthreads
collect2: error: ld returned 1 exit status
CMakeFiles/cmTC_1e557.dir/build.make:97: recipe for target 'cmTC_1e557' failed
make[1]: *** [cmTC_1e557] Error 1
make[1]: Leaving directory '/home/caroline/terragear_src/build/terragear/CMakeFiles/CMakeTmp'
Makefile:126: recipe for target 'cmTC_1e557/fast' failed
make: *** [cmTC_1e557/fast] Error 2
   

Je fais surement une erreur quelque part,désolé

Dernière modification par Silveraire40 (26/09/2016 18:30:13)


FG2016 1-1  W10  ACER Aspire X1430 - AMD E-350 dual-core - AMD Radéon HD6300   4GB DDR3 Memory

Hors ligne

#37 26/09/2016 19:05:19

ctesc356
Membre
Inscription : 18/05/2010
Messages : 2 229

Re : Terragear

Non tu ne fais pas d'erreur, c'est cette p..ain d'informatique wink
Pour les sources c'est bon.

Dans "CMakeError.log" j'ai plein d'erreurs aussi?! mais ça fonctionne!
Tu peux montrer "CMakeOutput.log" si des fois ce serait plus parlant.

Il ne trouve pas un truc
Que donne:

dpkg-query -l '*cgal*'


Intel i5 3570 3.4Mhz, Nvidia GTX 660, 8Go Ram, Linux Mint

Hors ligne

#38 26/09/2016 19:23:14

Silveraire40
Membre
Inscription : 2/05/2016
Messages : 165

Re : Terragear

Voici le résultat de dpkg.......

caroline@caroline-Vostro-1500 ~ $ dpkg-query -l '*cgal*'
Souhait=inconnU/Installé/suppRimé/Purgé/H=à garder
| État=Non/Installé/fichier-Config/dépaqUeté/échec-conFig/H=semi-installé/W=attend-traitement-déclenchements
|/ Err?=(aucune)/besoin Réinstallation (État,Err: majuscule=mauvais)
||/ Nom            Version      Architecture Description
+++-==============-============-============-=================================
ii  libcgal-dev:am 4.7-4        amd64        C++ library for computational geo
un  libcgal11      <aucune>     <aucune>     (aucune description n'est disponi
ii  libcgal11v5:am 4.7-4        amd64        C++ library for computational geo
caroline
  

Cmakeoutput

  The system is: Linux - 4.4.0-21-generic - x86_64
Compiling the C compiler identification source file "CMakeCCompilerId.c" succeeded.
Compiler: /usr/bin/cc 
Build flags: 
Id flags: 

The output was:
0


Compilation of the C compiler identification source "CMakeCCompilerId.c" produced "a.out"

The C compiler identification is GNU, found in "/home/caroline/terragear_src/build/terragear/CMakeFiles/3.5.1/CompilerIdC/a.out"

Compiling the CXX compiler identification source file "CMakeCXXCompilerId.cpp" succeeded.
Compiler: /usr/bin/c++ 
Build flags: 
Id flags: 

The output was:
0


Compilation of the CXX compiler identification source "CMakeCXXCompilerId.cpp" produced "a.out"

The CXX compiler identification is GNU, found in "/home/caroline/terragear_src/build/terragear/CMakeFiles/3.5.1/CompilerIdCXX/a.out"

Determining if the C compiler works passed with the following output:
Change Dir: /home/caroline/terragear_src/build/terragear/CMakeFiles/CMakeTmp

Run Build Command:"/usr/bin/make" "cmTC_1f792/fast"
/usr/bin/make -f CMakeFiles/cmTC_1f792.dir/build.make CMakeFiles/cmTC_1f792.dir/build
make[1]: Entering directory '/home/caroline/terragear_src/build/terragear/CMakeFiles/CMakeTmp'
Building C object CMakeFiles/cmTC_1f792.dir/testCCompiler.c.o
/usr/bin/cc     -o CMakeFiles/cmTC_1f792.dir/testCCompiler.c.o   -c /home/caroline/terragear_src/build/terragear/CMakeFiles/CMakeTmp/testCCompiler.c
Linking C executable cmTC_1f792
/usr/bin/cmake -E cmake_link_script CMakeFiles/cmTC_1f792.dir/link.txt --verbose=1
/usr/bin/cc       CMakeFiles/cmTC_1f792.dir/testCCompiler.c.o  -o cmTC_1f792 -rdynamic 
make[1]: Leaving directory '/home/caroline/terragear_src/build/terragear/CMakeFiles/CMakeTmp'


Detecting C compiler ABI info compiled with the following output:
Change Dir: /home/caroline/terragear_src/build/terragear/CMakeFiles/CMakeTmp

Run Build Command:"/usr/bin/make" "cmTC_2a6d2/fast"
/usr/bin/make -f CMakeFiles/cmTC_2a6d2.dir/build.make CMakeFiles/cmTC_2a6d2.dir/build
make[1]: Entering directory '/home/caroline/terragear_src/build/terragear/CMakeFiles/CMakeTmp'
Building C object CMakeFiles/cmTC_2a6d2.dir/CMakeCCompilerABI.c.o
/usr/bin/cc     -o CMakeFiles/cmTC_2a6d2.dir/CMakeCCompilerABI.c.o   -c /usr/share/cmake-3.5/Modules/CMakeCCompilerABI.c
Linking C executable cmTC_2a6d2
/usr/bin/cmake -E cmake_link_script CMakeFiles/cmTC_2a6d2.dir/link.txt --verbose=1
/usr/bin/cc      -v CMakeFiles/cmTC_2a6d2.dir/CMakeCCompilerABI.c.o  -o cmTC_2a6d2 -rdynamic  
Using built-in specs.
COLLECT_GCC=/usr/bin/cc
COLLECT_LTO_WRAPPER=/usr/lib/gcc/x86_64-linux-gnu/5/lto-wrapper
Target: x86_64-linux-gnu
Configured with: ../src/configure -v --with-pkgversion='Ubuntu 5.4.0-6ubuntu1~16.04.2' --with-bugurl=file:///usr/share/doc/gcc-5/README.Bugs --enable-languages=c,ada,c++,java,go,d,fortran,objc,obj-c++ --prefix=/usr --program-suffix=-5 --enable-shared --enable-linker-build-id --libexecdir=/usr/lib --without-included-gettext --enable-threads=posix --libdir=/usr/lib --enable-nls --with-sysroot=/ --enable-clocale=gnu --enable-libstdcxx-debug --enable-libstdcxx-time=yes --with-default-libstdcxx-abi=new --enable-gnu-unique-object --disable-vtable-verify --enable-libmpx --enable-plugin --with-system-zlib --disable-browser-plugin --enable-java-awt=gtk --enable-gtk-cairo --with-java-home=/usr/lib/jvm/java-1.5.0-gcj-5-amd64/jre --enable-java-home --with-jvm-root-dir=/usr/lib/jvm/java-1.5.0-gcj-5-amd64 --with-jvm-jar-dir=/usr/lib/jvm-exports/java-1.5.0-gcj-5-amd64 --with-arch-directory=amd64 --with-ecj-jar=/usr/share/java/eclipse-ecj.jar --enable-objc-gc --enable-multiarch --disable-werror --with-arch-32=i686 --with-abi=m64 --with-multilib-list=m32,m64,mx32 --enable-multilib --with-tune=generic --enable-checking=release --build=x86_64-linux-gnu --host=x86_64-linux-gnu --target=x86_64-linux-gnu
Thread model: posix
gcc version 5.4.0 20160609 (Ubuntu 5.4.0-6ubuntu1~16.04.2) 
COMPILER_PATH=/usr/lib/gcc/x86_64-linux-gnu/5/:/usr/lib/gcc/x86_64-linux-gnu/5/:/usr/lib/gcc/x86_64-linux-gnu/:/usr/lib/gcc/x86_64-linux-gnu/5/:/usr/lib/gcc/x86_64-linux-gnu/
LIBRARY_PATH=/usr/lib/gcc/x86_64-linux-gnu/5/:/usr/lib/gcc/x86_64-linux-gnu/5/../../../x86_64-linux-gnu/:/usr/lib/gcc/x86_64-linux-gnu/5/../../../../lib/:/lib/x86_64-linux-gnu/:/lib/../lib/:/usr/lib/x86_64-linux-gnu/:/usr/lib/../lib/:/usr/lib/gcc/x86_64-linux-gnu/5/../../../:/lib/:/usr/lib/
COLLECT_GCC_OPTIONS='-v' '-o' 'cmTC_2a6d2' '-rdynamic' '-mtune=generic' '-march=x86-64'
 /usr/lib/gcc/x86_64-linux-gnu/5/collect2 -plugin /usr/lib/gcc/x86_64-linux-gnu/5/liblto_plugin.so -plugin-opt=/usr/lib/gcc/x86_64-linux-gnu/5/lto-wrapper -plugin-opt=-fresolution=/tmp/ccByjIRU.res -plugin-opt=-pass-through=-lgcc -plugin-opt=-pass-through=-lgcc_s -plugin-opt=-pass-through=-lc -plugin-opt=-pass-through=-lgcc -plugin-opt=-pass-through=-lgcc_s --sysroot=/ --build-id --eh-frame-hdr -m elf_x86_64 --hash-style=gnu --as-needed -export-dynamic -dynamic-linker /lib64/ld-linux-x86-64.so.2 -z relro -o cmTC_2a6d2 /usr/lib/gcc/x86_64-linux-gnu/5/../../../x86_64-linux-gnu/crt1.o /usr/lib/gcc/x86_64-linux-gnu/5/../../../x86_64-linux-gnu/crti.o /usr/lib/gcc/x86_64-linux-gnu/5/crtbegin.o -L/usr/lib/gcc/x86_64-linux-gnu/5 -L/usr/lib/gcc/x86_64-linux-gnu/5/../../../x86_64-linux-gnu -L/usr/lib/gcc/x86_64-linux-gnu/5/../../../../lib -L/lib/x86_64-linux-gnu -L/lib/../lib -L/usr/lib/x86_64-linux-gnu -L/usr/lib/../lib -L/usr/lib/gcc/x86_64-linux-gnu/5/../../.. CMakeFiles/cmTC_2a6d2.dir/CMakeCCompilerABI.c.o -lgcc --as-needed -lgcc_s --no-as-needed -lc -lgcc --as-needed -lgcc_s --no-as-needed /usr/lib/gcc/x86_64-linux-gnu/5/crtend.o /usr/lib/gcc/x86_64-linux-gnu/5/../../../x86_64-linux-gnu/crtn.o
make[1]: Leaving directory '/home/caroline/terragear_src/build/terragear/CMakeFiles/CMakeTmp'


Parsed C implicit link information from above output:
  link line regex: [^( *|.*[/\])(ld|([^/\]+-)?ld|collect2)[^/\]*( |$)]
  ignore line: [Change Dir: /home/caroline/terragear_src/build/terragear/CMakeFiles/CMakeTmp]
  ignore line: []
  ignore line: [Run Build Command:"/usr/bin/make" "cmTC_2a6d2/fast"]
  ignore line: [/usr/bin/make -f CMakeFiles/cmTC_2a6d2.dir/build.make CMakeFiles/cmTC_2a6d2.dir/build]
  ignore line: [make[1]: Entering directory '/home/caroline/terragear_src/build/terragear/CMakeFiles/CMakeTmp']
  ignore line: [Building C object CMakeFiles/cmTC_2a6d2.dir/CMakeCCompilerABI.c.o]
  ignore line: [/usr/bin/cc     -o CMakeFiles/cmTC_2a6d2.dir/CMakeCCompilerABI.c.o   -c /usr/share/cmake-3.5/Modules/CMakeCCompilerABI.c]
  ignore line: [Linking C executable cmTC_2a6d2]
  ignore line: [/usr/bin/cmake -E cmake_link_script CMakeFiles/cmTC_2a6d2.dir/link.txt --verbose=1]
  ignore line: [/usr/bin/cc      -v CMakeFiles/cmTC_2a6d2.dir/CMakeCCompilerABI.c.o  -o cmTC_2a6d2 -rdynamic  ]
  ignore line: [Using built-in specs.]
  ignore line: [COLLECT_GCC=/usr/bin/cc]
  ignore line: [COLLECT_LTO_WRAPPER=/usr/lib/gcc/x86_64-linux-gnu/5/lto-wrapper]
  ignore line: [Target: x86_64-linux-gnu]
  ignore line: [Configured with: ../src/configure -v --with-pkgversion='Ubuntu 5.4.0-6ubuntu1~16.04.2' --with-bugurl=file:///usr/share/doc/gcc-5/README.Bugs --enable-languages=c,ada,c++,java,go,d,fortran,objc,obj-c++ --prefix=/usr --program-suffix=-5 --enable-shared --enable-linker-build-id --libexecdir=/usr/lib --without-included-gettext --enable-threads=posix --libdir=/usr/lib --enable-nls --with-sysroot=/ --enable-clocale=gnu --enable-libstdcxx-debug --enable-libstdcxx-time=yes --with-default-libstdcxx-abi=new --enable-gnu-unique-object --disable-vtable-verify --enable-libmpx --enable-plugin --with-system-zlib --disable-browser-plugin --enable-java-awt=gtk --enable-gtk-cairo --with-java-home=/usr/lib/jvm/java-1.5.0-gcj-5-amd64/jre --enable-java-home --with-jvm-root-dir=/usr/lib/jvm/java-1.5.0-gcj-5-amd64 --with-jvm-jar-dir=/usr/lib/jvm-exports/java-1.5.0-gcj-5-amd64 --with-arch-directory=amd64 --with-ecj-jar=/usr/share/java/eclipse-ecj.jar --enable-objc-gc --enable-multiarch --disable-werror --with-arch-32=i686 --with-abi=m64 --with-multilib-list=m32,m64,mx32 --enable-multilib --with-tune=generic --enable-checking=release --build=x86_64-linux-gnu --host=x86_64-linux-gnu --target=x86_64-linux-gnu]
  ignore line: [Thread model: posix]
  ignore line: [gcc version 5.4.0 20160609 (Ubuntu 5.4.0-6ubuntu1~16.04.2) ]
  ignore line: [COMPILER_PATH=/usr/lib/gcc/x86_64-linux-gnu/5/:/usr/lib/gcc/x86_64-linux-gnu/5/:/usr/lib/gcc/x86_64-linux-gnu/:/usr/lib/gcc/x86_64-linux-gnu/5/:/usr/lib/gcc/x86_64-linux-gnu/]
  ignore line: [LIBRARY_PATH=/usr/lib/gcc/x86_64-linux-gnu/5/:/usr/lib/gcc/x86_64-linux-gnu/5/../../../x86_64-linux-gnu/:/usr/lib/gcc/x86_64-linux-gnu/5/../../../../lib/:/lib/x86_64-linux-gnu/:/lib/../lib/:/usr/lib/x86_64-linux-gnu/:/usr/lib/../lib/:/usr/lib/gcc/x86_64-linux-gnu/5/../../../:/lib/:/usr/lib/]
  ignore line: [COLLECT_GCC_OPTIONS='-v' '-o' 'cmTC_2a6d2' '-rdynamic' '-mtune=generic' '-march=x86-64']
  link line: [ /usr/lib/gcc/x86_64-linux-gnu/5/collect2 -plugin /usr/lib/gcc/x86_64-linux-gnu/5/liblto_plugin.so -plugin-opt=/usr/lib/gcc/x86_64-linux-gnu/5/lto-wrapper -plugin-opt=-fresolution=/tmp/ccByjIRU.res -plugin-opt=-pass-through=-lgcc -plugin-opt=-pass-through=-lgcc_s -plugin-opt=-pass-through=-lc -plugin-opt=-pass-through=-lgcc -plugin-opt=-pass-through=-lgcc_s --sysroot=/ --build-id --eh-frame-hdr -m elf_x86_64 --hash-style=gnu --as-needed -export-dynamic -dynamic-linker /lib64/ld-linux-x86-64.so.2 -z relro -o cmTC_2a6d2 /usr/lib/gcc/x86_64-linux-gnu/5/../../../x86_64-linux-gnu/crt1.o /usr/lib/gcc/x86_64-linux-gnu/5/../../../x86_64-linux-gnu/crti.o /usr/lib/gcc/x86_64-linux-gnu/5/crtbegin.o -L/usr/lib/gcc/x86_64-linux-gnu/5 -L/usr/lib/gcc/x86_64-linux-gnu/5/../../../x86_64-linux-gnu -L/usr/lib/gcc/x86_64-linux-gnu/5/../../../../lib -L/lib/x86_64-linux-gnu -L/lib/../lib -L/usr/lib/x86_64-linux-gnu -L/usr/lib/../lib -L/usr/lib/gcc/x86_64-linux-gnu/5/../../.. CMakeFiles/cmTC_2a6d2.dir/CMakeCCompilerABI.c.o -lgcc --as-needed -lgcc_s --no-as-needed -lc -lgcc --as-needed -lgcc_s --no-as-needed /usr/lib/gcc/x86_64-linux-gnu/5/crtend.o /usr/lib/gcc/x86_64-linux-gnu/5/../../../x86_64-linux-gnu/crtn.o]
    arg [/usr/lib/gcc/x86_64-linux-gnu/5/collect2] ==> ignore
    arg [-plugin] ==> ignore
    arg [/usr/lib/gcc/x86_64-linux-gnu/5/liblto_plugin.so] ==> ignore
    arg [-plugin-opt=/usr/lib/gcc/x86_64-linux-gnu/5/lto-wrapper] ==> ignore
    arg [-plugin-opt=-fresolution=/tmp/ccByjIRU.res] ==> ignore
    arg [-plugin-opt=-pass-through=-lgcc] ==> ignore
    arg [-plugin-opt=-pass-through=-lgcc_s] ==> ignore
    arg [-plugin-opt=-pass-through=-lc] ==> ignore
    arg [-plugin-opt=-pass-through=-lgcc] ==> ignore
    arg [-plugin-opt=-pass-through=-lgcc_s] ==> ignore
    arg [--sysroot=/] ==> ignore
    arg [--build-id] ==> ignore
    arg [--eh-frame-hdr] ==> ignore
    arg [-m] ==> ignore
    arg [elf_x86_64] ==> ignore
    arg [--hash-style=gnu] ==> ignore
    arg [--as-needed] ==> ignore
    arg [-export-dynamic] ==> ignore
    arg [-dynamic-linker] ==> ignore
    arg [/lib64/ld-linux-x86-64.so.2] ==> ignore
    arg [-zrelro] ==> ignore
    arg [-o] ==> ignore
    arg [cmTC_2a6d2] ==> ignore
    arg [/usr/lib/gcc/x86_64-linux-gnu/5/../../../x86_64-linux-gnu/crt1.o] ==> ignore
    arg [/usr/lib/gcc/x86_64-linux-gnu/5/../../../x86_64-linux-gnu/crti.o] ==> ignore
    arg [/usr/lib/gcc/x86_64-linux-gnu/5/crtbegin.o] ==> ignore
    arg [-L/usr/lib/gcc/x86_64-linux-gnu/5] ==> dir [/usr/lib/gcc/x86_64-linux-gnu/5]
    arg [-L/usr/lib/gcc/x86_64-linux-gnu/5/../../../x86_64-linux-gnu] ==> dir [/usr/lib/gcc/x86_64-linux-gnu/5/../../../x86_64-linux-gnu]
    arg [-L/usr/lib/gcc/x86_64-linux-gnu/5/../../../../lib] ==> dir [/usr/lib/gcc/x86_64-linux-gnu/5/../../../../lib]
    arg [-L/lib/x86_64-linux-gnu] ==> dir [/lib/x86_64-linux-gnu]
    arg [-L/lib/../lib] ==> dir [/lib/../lib]
    arg [-L/usr/lib/x86_64-linux-gnu] ==> dir [/usr/lib/x86_64-linux-gnu]
    arg [-L/usr/lib/../lib] ==> dir [/usr/lib/../lib]
    arg [-L/usr/lib/gcc/x86_64-linux-gnu/5/../../..] ==> dir [/usr/lib/gcc/x86_64-linux-gnu/5/../../..]
    arg [CMakeFiles/cmTC_2a6d2.dir/CMakeCCompilerABI.c.o] ==> ignore
    arg [-lgcc] ==> lib [gcc]
    arg [--as-needed] ==> ignore
    arg [-lgcc_s] ==> lib [gcc_s]
    arg [--no-as-needed] ==> ignore
    arg [-lc] ==> lib [c]
    arg [-lgcc] ==> lib [gcc]
    arg [--as-needed] ==> ignore
    arg [-lgcc_s] ==> lib [gcc_s]
    arg [--no-as-needed] ==> ignore
    arg [/usr/lib/gcc/x86_64-linux-gnu/5/crtend.o] ==> ignore
    arg [/usr/lib/gcc/x86_64-linux-gnu/5/../../../x86_64-linux-gnu/crtn.o] ==> ignore
  remove lib [gcc]
  remove lib [gcc_s]
  remove lib [gcc]
  remove lib [gcc_s]
  collapse library dir [/usr/lib/gcc/x86_64-linux-gnu/5] ==> [/usr/lib/gcc/x86_64-linux-gnu/5]
  collapse library dir [/usr/lib/gcc/x86_64-linux-gnu/5/../../../x86_64-linux-gnu] ==> [/usr/lib/x86_64-linux-gnu]
  collapse library dir [/usr/lib/gcc/x86_64-linux-gnu/5/../../../../lib] ==> [/usr/lib]
  collapse library dir [/lib/x86_64-linux-gnu] ==> [/lib/x86_64-linux-gnu]
  collapse library dir [/lib/../lib] ==> [/lib]
  collapse library dir [/usr/lib/x86_64-linux-gnu] ==> [/usr/lib/x86_64-linux-gnu]
  collapse library dir [/usr/lib/../lib] ==> [/usr/lib]
  collapse library dir [/usr/lib/gcc/x86_64-linux-gnu/5/../../..] ==> [/usr/lib]
  implicit libs: [c]
  implicit dirs: [/usr/lib/gcc/x86_64-linux-gnu/5;/usr/lib/x86_64-linux-gnu;/usr/lib;/lib/x86_64-linux-gnu;/lib]
  implicit fwks: []




Detecting C [-std=c11] compiler features compiled with the following output:
Change Dir: /home/caroline/terragear_src/build/terragear/CMakeFiles/CMakeTmp

Run Build Command:"/usr/bin/make" "cmTC_9b231/fast"
/usr/bin/make -f CMakeFiles/cmTC_9b231.dir/build.make CMakeFiles/cmTC_9b231.dir/build
make[1]: Entering directory '/home/caroline/terragear_src/build/terragear/CMakeFiles/CMakeTmp'
Building C object CMakeFiles/cmTC_9b231.dir/feature_tests.c.o
/usr/bin/cc    -std=c11 -o CMakeFiles/cmTC_9b231.dir/feature_tests.c.o   -c /home/caroline/terragear_src/build/terragear/CMakeFiles/feature_tests.c
Linking C executable cmTC_9b231
/usr/bin/cmake -E cmake_link_script CMakeFiles/cmTC_9b231.dir/link.txt --verbose=1
/usr/bin/cc       CMakeFiles/cmTC_9b231.dir/feature_tests.c.o  -o cmTC_9b231 -rdynamic 
make[1]: Leaving directory '/home/caroline/terragear_src/build/terragear/CMakeFiles/CMakeTmp'


    Feature record: C_FEATURE:1c_function_prototypes
    Feature record: C_FEATURE:1c_restrict
    Feature record: C_FEATURE:1c_static_assert
    Feature record: C_FEATURE:1c_variadic_macros


Detecting C [-std=c99] compiler features compiled with the following output:
Change Dir: /home/caroline/terragear_src/build/terragear/CMakeFiles/CMakeTmp

Run Build Command:"/usr/bin/make" "cmTC_ddae2/fast"
/usr/bin/make -f CMakeFiles/cmTC_ddae2.dir/build.make CMakeFiles/cmTC_ddae2.dir/build
make[1]: Entering directory '/home/caroline/terragear_src/build/terragear/CMakeFiles/CMakeTmp'
Building C object CMakeFiles/cmTC_ddae2.dir/feature_tests.c.o
/usr/bin/cc    -std=c99 -o CMakeFiles/cmTC_ddae2.dir/feature_tests.c.o   -c /home/caroline/terragear_src/build/terragear/CMakeFiles/feature_tests.c
Linking C executable cmTC_ddae2
/usr/bin/cmake -E cmake_link_script CMakeFiles/cmTC_ddae2.dir/link.txt --verbose=1
/usr/bin/cc       CMakeFiles/cmTC_ddae2.dir/feature_tests.c.o  -o cmTC_ddae2 -rdynamic 
make[1]: Leaving directory '/home/caroline/terragear_src/build/terragear/CMakeFiles/CMakeTmp'

   

FG2016 1-1  W10  ACER Aspire X1430 - AMD E-350 dual-core - AMD Radéon HD6300   4GB DDR3 Memory

Hors ligne

#39 27/09/2016 13:46:22

ctesc356
Membre
Inscription : 18/05/2010
Messages : 2 229

Re : Terragear

Bonjour,
je crois que j'ai trouvé smile
J'ai installé mint18 dans une virtualbox pour pouvoir bidouiller le truc.
Il me donnait la même erreur que chez toi.
Il semble qu'il y ait un bug dans libcgal qui n'a pas encore été corrigé partout, enfin c'est ce que j'ai compris en fouinant sur les sites et en lisant entre les lignes.
Résultat, il faut installer "libcgal-qt5-dev"

sudo apt-get install libcgal-qt5-dev

devrait le faire. Ici je l'ai installé par synaptic mais c'est pareil.
J'ai relancé:

./download_and_compile.sh -j4 -an -pn -dn TERRAGEAR

dans "terragear_src" et c'est passé.

Dernière modification par ctesc356 (27/09/2016 13:54:08)


Intel i5 3570 3.4Mhz, Nvidia GTX 660, 8Go Ram, Linux Mint

Hors ligne

#40 27/09/2016 18:43:21

Silveraire40
Membre
Inscription : 2/05/2016
Messages : 165

Re : Terragear

Je dois être maudit,

   caroline@caroline-Vostro-1500 ~ $ /home/caroline/terragear_src/download_and_compile.sh -j4 -an -pn -dn TERRAGEAR
**************************************
*                                    *
* Warning, the compilation process   *
* is going to use 12 or more Gbytes  *
* of space and at least a couple of  *
* hours to download and build FG.    *
*                                    *
* Please, be patient ......          *
*                                    *
**************************************
****************************************
*************** TERRAGEAR **************
****************************************
CMake Error: The source directory "/home/caroline/terragear" does not appear to contain CMakeLists.txt.
Specify --help for usage, or press the help button on the CMake GUI.
make: *** No targets specified and no makefile found.  Stop.
make: *** No rule to make target 'install'.  Stop.

download_and_compile.sh has finished to work
 

Le chemin demande ne devrait il pas être  caro../terragear_src

Je constate qu'un fichier " terragear "  est généré  dans  ../caroline   a chaque lancement de ce  D&C terragear  ce dossier est vide.pour moi c'est un grand mystère.

Dernière modification par Silveraire40 (4/12/2016 18:30:05)


FG2016 1-1  W10  ACER Aspire X1430 - AMD E-350 dual-core - AMD Radéon HD6300   4GB DDR3 Memory

Hors ligne

#41 27/09/2016 18:54:08

ctesc356
Membre
Inscription : 18/05/2010
Messages : 2 229

Re : Terragear

Apparemment il ne trouve pas les sources de terragear.
Il devrait les trouver dans "/home/caroline/terragear_src/terragear"
Il les trouvait hier, as-tu modifié quelque chose?


Intel i5 3570 3.4Mhz, Nvidia GTX 660, 8Go Ram, Linux Mint

Hors ligne

#42 27/09/2016 19:08:25

Silveraire40
Membre
Inscription : 2/05/2016
Messages : 165

Re : Terragear

Non aucune modification si ce n'est les deux que tu viens de me transmettre la première à l'air de s'être déroulée convenablement
j'ai bien un dossier terragear au bon endroit


FG2016 1-1  W10  ACER Aspire X1430 - AMD E-350 dual-core - AMD Radéon HD6300   4GB DDR3 Memory

Hors ligne

#43 27/09/2016 20:09:21

ctesc356
Membre
Inscription : 18/05/2010
Messages : 2 229

Re : Terragear

C'est ou au bon endroit?  "/home/caroline/terragear_src/" , que contient'il?
Si tu as un dossier "terragear" dans "/home/caroline" supprime le.

ça vient de ta ligne de lancement:

caroline@caroline-Vostro-1500 ~ $ /home/caroline/terragear_src/download_and_compile.sh -j4 -an -pn -dn TERRAGEAR

fais

cd terragear_src

pour te rendre dans le dossier "terragear_src" et là tu lances d&c

./download_and_compile.sh -j4 -an -pn -dn TERRAGEAR

ça ne supporte pas la fantaisie wink

Edit: oups, je dois être fatigué smile si un administrateur peut supprimer les 2 posts précédents... merci (fait; Dany)

Dernière modification par ctesc356 (27/09/2016 23:13:45)


Intel i5 3570 3.4Mhz, Nvidia GTX 660, 8Go Ram, Linux Mint

Hors ligne

#44 28/09/2016 6:44:46

Silveraire40
Membre
Inscription : 2/05/2016
Messages : 165

Re : Terragear

Bonjour
Installation réussie  grand merci à toi ctesc356 d'avoir été si patient.
Il me reste à l'expérimenter alors surement à bientot.


FG2016 1-1  W10  ACER Aspire X1430 - AMD E-350 dual-core - AMD Radéon HD6300   4GB DDR3 Memory

Hors ligne

#45 29/09/2016 16:55:24

Silveraire40
Membre
Inscription : 2/05/2016
Messages : 165

Re : Terragear

Bonjour,
J'ai encore un petit problème , j'espère ne pas être le seul, avec le   mapserver.mgras   dont le lien se trouve au début de la discution,
Une fois fait " Downloasd Shapesfiles"  et dans "Download every polygon ...." rentré les données géographiques, au lancement un message de serveur non disponible.


FG2016 1-1  W10  ACER Aspire X1430 - AMD E-350 dual-core - AMD Radéon HD6300   4GB DDR3 Memory

Hors ligne

#46 29/09/2016 18:31:11

ctesc356
Membre
Inscription : 18/05/2010
Messages : 2 229

Re : Terragear

Bonjour,
ça arrive que le serveur cafouille.
J'ai fait un essai, ça fonctionne ici.
Que rentres-tu comme coordonnées?


Intel i5 3570 3.4Mhz, Nvidia GTX 660, 8Go Ram, Linux Mint

Hors ligne

#47 29/09/2016 19:04:43

Silveraire40
Membre
Inscription : 2/05/2016
Messages : 165

Re : Terragear

Pour le moment je n'ai essayé pour LFDH que
43.6721 N *  43.6937  S            0.59412 O * 0.6937  E


FG2016 1-1  W10  ACER Aspire X1430 - AMD E-350 dual-core - AMD Radéon HD6300   4GB DDR3 Memory

Hors ligne

#48 29/09/2016 20:00:06

ctesc356
Membre
Inscription : 18/05/2010
Messages : 2 229

Re : Terragear

43.6721 S  43.6937 N            0.59412 O  0.6937  E

il me refuse aussi. Zone trop restreinte probablement.
Mais que veux-tu faire avec ça?
lfdh210.png
Pour obtenir quelque chose de cohérent: http://fr.flightgear.org/forums/viewtop … 263#p36263
43.5N - 43.875N     0.25E - 1.0E


Intel i5 3570 3.4Mhz, Nvidia GTX 660, 8Go Ram, Linux Mint

Hors ligne

#49 30/09/2016 7:13:28

Silveraire40
Membre
Inscription : 2/05/2016
Messages : 165

Re : Terragear

Bonjour
Encore une étourderie sur la position E c'etait 0.6337,j'avais réduit cet espace en tenant compte des infos de la page ou l'on met les coordonnées.
J'ai bien réessayé ce matin avec tes coordonnées mais j'ai toujours ce résultat:

Internal Server Error
The server encountered an internal error or misconfiguration and was unable to complete your request.
Please contact the server administrator at [no address given] to inform them of the time this error occurred, and the actions you performed just before this error.
More information about this error may be available in the server error log.

Peut être une erreur de ma part:
    j'ouvre programme   *   j'appuie sur  " Downloasd Shapesfiles"  * j'entre les coordonnées dans le cadre de  "Download every polygon ...." * j'appuie sur le bouton


FG2016 1-1  W10  ACER Aspire X1430 - AMD E-350 dual-core - AMD Radéon HD6300   4GB DDR3 Memory

Hors ligne

#50 30/09/2016 9:14:53

ctesc356
Membre
Inscription : 18/05/2010
Messages : 2 229

Re : Terragear

Bonjour,
pareil ici ce matin. Le serveur est probablement surchargé.
Il ne reste qu'a essayer de temps en temps en espérant que ça reviendra.


Intel i5 3570 3.4Mhz, Nvidia GTX 660, 8Go Ram, Linux Mint

Hors ligne

Pied de page des forums