Forum Flightgear France

Une communauté prend son envol

Vous n'êtes pas identifié(e).

Annonce

Futur nouvel inscrit, tu dois au préalable lire l'intégralité des 10 articles des règles, s'il te plaît. Tout nouveau compte qui ne respecte pas les règles sera supprimé par l'administration.

#1 19/03/2019 11:00:25

Clm76
Membre
Lieu : LFOH
Inscription : 22/10/2012
Messages : 1 048

Erreur compilation FGFS

Bonjour,

Compilation complète de ce matin dans un nouveau répertoire (fg2019_2) :
PLIB : ok
CMAKE : ok
OPENRTI : ok
OSG : ok
SIMGEAR : ok
FGFS : plusieurs erreurs. Voici le log :

./download_and_compile.sh FGFS
VERSION=$Id
APT_GET_UPDATE=y
DOWNLOAD_PACKAGES=y
COMPILE=y
RECONFIGURE=y
DOWNLOAD=y
JOPTION= -j12 
OOPTION=
BUILD_TYPE=RelWithDebInfo
***********************************
Considering a package alternative: libcurl4-openssl-dev libcurl4-gnutls-dev
Package alternative matched for libcurl4-openssl-dev
Considering a package alternative: libopenscenegraph-3.4-dev libopenscenegraph-dev libopenscenegraph-[0-9]+\.[0-9]+-dev
Package alternative matched for libopenscenegraph-dev
Considering a package alternative: libpng-dev libpng12-dev libpng16-dev
Package alternative matched for libpng12-dev
Considering an optional package alternative: qml-module-qtquick2
Optional package alternative matched for qml-module-qtquick2
Considering an optional package alternative: qml-module-qtquick-window2
Optional package alternative matched for qml-module-qtquick-window2
Considering an optional package alternative: qml-module-qtquick-dialogs
Optional package alternative matched for qml-module-qtquick-dialogs
Considering an optional package alternative: qtbase5-private-dev
Optional package alternative matched for qtbase5-private-dev
Considering an optional package alternative: qtdeclarative5-private-dev
Optional package alternative matched for qtdeclarative5-private-dev
DIRECTORY= /home/chris/fg2019_2
***********************************
****************************************
************** FLIGHTGEAR **************
****************************************
CMAKE Build type: RelWithDebInfo
-- Setting build type to 'Dev' as none was specified.
-- The C compiler identification is GNU 5.4.0
-- The CXX compiler identification is GNU 5.4.0
-- Check for working C compiler: /usr/bin/cc
-- Check for working C compiler: /usr/bin/cc -- works
-- Detecting C compiler ABI info
-- Detecting C compiler ABI info - done
-- Detecting C compile features
-- Detecting C compile features - done
-- Check for working CXX compiler: /usr/bin/c++
-- Check for working CXX compiler: /usr/bin/c++ -- works
-- Detecting CXX compiler ABI info
-- Detecting CXX compiler ABI info - done
-- Detecting CXX compile features
-- Detecting CXX compile features - done
-- System is: Linux
-- Linux distro is: LinuxMint
-- Web browser launcher command is: xdg-open
-- Using default data directory for base package:  /home/chris/fg2019_2/install/flightgear/lib/FlightGear
-- Looking for pthread.h
-- Looking for pthread.h - found
-- Performing Test CMAKE_HAVE_LIBC_PTHREAD
-- Performing Test CMAKE_HAVE_LIBC_PTHREAD - Failed
-- Looking for pthread_create in pthreads
-- Looking for pthread_create in pthreads - not found
-- Looking for pthread_create in pthread
-- Looking for pthread_create in pthread - found
-- Found Threads: TRUE  
-- Found X11: /usr/include   
-- Looking for XOpenDisplay in /usr/lib/x86_64-linux-gnu/libX11.so;/usr/lib/x86_64-linux-gnu/libXext.so
-- Looking for XOpenDisplay in /usr/lib/x86_64-linux-gnu/libX11.so;/usr/lib/x86_64-linux-gnu/libXext.so - found
-- Looking for gethostbyname
-- Looking for gethostbyname - found
-- Looking for connect
-- Looking for connect - found
-- Looking for remove
-- Looking for remove - found
-- Looking for shmat
-- Looking for shmat - found
-- Looking for IceConnectionNumber in ICE
-- Looking for IceConnectionNumber in ICE - found
-- libudev stable: 1
-- Found UDev: /usr/lib/x86_64-linux-gnu/libudev.so
--    include: /usr/include
-- event-based input enabled. Using /usr/lib/x86_64-linux-gnu/libudev.so
-- Boost version: 1.58.0
-- Found OpenGL: /usr/lib/x86_64-linux-gnu/libGL.so   
-- Found osgText: /home/chris/fg2019_2/install/openscenegraph/lib/libosgText.so  
-- Found osgSim: /home/chris/fg2019_2/install/openscenegraph/lib/libosgSim.so  
-- Found osgDB: /home/chris/fg2019_2/install/openscenegraph/lib/libosgDB.so  
-- Found osgParticle: /home/chris/fg2019_2/install/openscenegraph/lib/libosgParticle.so  
-- Found osgFX: /home/chris/fg2019_2/install/openscenegraph/lib/libosgFX.so  
-- Found osgUtil: /home/chris/fg2019_2/install/openscenegraph/lib/libosgUtil.so  
-- Found osgViewer: /home/chris/fg2019_2/install/openscenegraph/lib/libosgViewer.so  
-- Found osgGA: /home/chris/fg2019_2/install/openscenegraph/lib/libosgGA.so  
-- Found osg: /home/chris/fg2019_2/install/openscenegraph/lib/libosg.so  
-- Found OpenThreads: /home/chris/fg2019_2/install/openscenegraph/lib/libOpenThreads.so  
-- Found OpenSceneGraph: /home/chris/fg2019_2/install/openscenegraph/lib/libosgText.so;/home/chris/fg2019_2/install/openscenegraph/lib/libosgSim.so;/home/chris/fg2019_2/install/openscenegraph/lib/libosgDB.so;/home/chris/fg2019_2/install/openscenegraph/lib/libosgParticle.so;/home/chris/fg2019_2/install/openscenegraph/lib/libosgFX.so;/home/chris/fg2019_2/install/openscenegraph/lib/libosgUtil.so;/home/chris/fg2019_2/install/openscenegraph/lib/libosgViewer.so;/home/chris/fg2019_2/install/openscenegraph/lib/libosgGA.so;/home/chris/fg2019_2/install/openscenegraph/lib/libosg.so;/home/chris/fg2019_2/install/openscenegraph/lib/libOpenThreads.so (found suitable version "3.4.2", minimum required is "3.2.0") 
-- Found PkgConfig: /usr/bin/pkg-config (found version "0.29.1") 
-- Checking for module 'dbus-1'
--   Found dbus-1, version 1.10.6
-- Using DBus
-- Qt launcher enabled, checking for Qt >= 5.4 / qmake
-- Will enable Qt launcher GUI
--   Qt5Widgets version: 5.5.1
--   Qt5Widgets include dir: /usr/include/x86_64-linux-gnu/qt5/;/usr/include/x86_64-linux-gnu/qt5/QtWidgets;/usr/include/x86_64-linux-gnu/qt5/QtGui;/usr/include/x86_64-linux-gnu/qt5/QtCore;/usr/lib/x86_64-linux-gnu/qt5//mkspecs/linux-g++-64;/usr/include
-- Couldn't find translations data, will not include translated string in the executable
-- Could NOT find Qt5LinguistTools (missing: Qt5LinguistTools_DIR)
CMake Warning at CMakeModules/Translations.cmake:18 (find_package):
  Found package configuration file:

    /usr/lib/x86_64-linux-gnu/cmake/Qt5/Qt5Config.cmake

  but it set Qt5_FOUND to FALSE so package "Qt5" is considered to be NOT
  FOUND.  Reason given by package:

  Failed to find Qt5 component "LinguistTools" config file at
  "/usr/lib/x86_64-linux-gnu/cmake/Qt5LinguistTools/Qt5LinguistToolsConfig.cmake"


  

Call Stack (most recent call first):
  CMakeLists.txt:333 (include)


-- /home/chris/fg2019_2/install/plib/include
-- Found PLIB: optimized;/home/chris/fg2019_2/install/plib/lib/libplibpuaux.a;debug;/home/chris/fg2019_2/install/plib/lib/libplibpuaux.a;optimized;/home/chris/fg2019_2/install/plib/lib/libplibpu.a;debug;/home/chris/fg2019_2/install/plib/lib/libplibpu.a;optimized;/home/chris/fg2019_2/install/plib/lib/libplibfnt.a;debug;/home/chris/fg2019_2/install/plib/lib/libplibfnt.a;optimized;/home/chris/fg2019_2/install/plib/lib/libplibsg.a;debug;/home/chris/fg2019_2/install/plib/lib/libplibsg.a;optimized;/home/chris/fg2019_2/install/plib/lib/libplibul.a;debug;/home/chris/fg2019_2/install/plib/lib/libplibul.a  
-- Min Simgear version is 2019.2.0
-- Found ZLIB: /usr/lib/x86_64-linux-gnu/libz.so (found version "1.2.8") 
-- Looking for unistd.h
-- Looking for unistd.h - found
-- Looking for sys/time.h
-- Looking for sys/time.h - found
-- Looking for sys/timeb.h
-- Looking for sys/timeb.h - found
-- Looking for windows.h
-- Looking for windows.h - not found
-- Looking for timegm
-- Looking for timegm - found
-- Looking for daylight
-- Looking for daylight - found
-- Looking for ftime
-- Looking for ftime - found
-- Looking for gettimeofday
-- Looking for gettimeofday - found
-- RTI: DISABLED
-- OpenMP: DISABLED
-- SSE/SSE2 support: ENABLED
-- Looking for mkfifo
-- Looking for mkfifo - found
-- Enabling legacy joystick code (from PLIB)
-- Found PNG: /usr/lib/x86_64-linux-gnu/libpng.so (found version "1.2.54") 
-- Found GLEW: /usr/include (found version "1.13.0") 
-- Found Freetype: /usr/lib/x86_64-linux-gnu/libfreetype.so  
-- Found GLUT: /usr/lib/x86_64-linux-gnu/libglut.a  
-- found GLUT inc /usr/include, lib /usr/lib/x86_64-linux-gnu/libglut.a;/usr/lib/x86_64-linux-gnu/libXmu.a;/usr/lib/x86_64-linux-gnu/libXi.a 
-- Found OpenAL: /usr/lib/x86_64-linux-gnu/libopenal.so  
-- CppUnit: Building the FlightGear supplied CppUnit library
-- Configuring done
-- Generating done
-- Build files have been written to: /home/chris/fg2019_2/build/flightgear
MAKE flightgear
Scanning dependencies of target fgtraffic
Scanning dependencies of target PLIBJoystick
[  0%] Building CXX object 3rdparty/joystick/CMakeFiles/PLIBJoystick.dir/js.cxx.o
Scanning dependencies of target hts_engine
Scanning dependencies of target MIDGsmooth
Scanning dependencies of target GPSsmooth
[  0%] Building CXX object utils/traffic/CMakeFiles/fgtraffic.dir/fgtraffic.cxx.o
[  0%] Building C object 3rdparty/hts_engine_API/CMakeFiles/hts_engine.dir/lib/HTS_audio.c.o
Scanning dependencies of target UGsmooth
[  1%] Building CXX object utils/GPSsmooth/CMakeFiles/MIDGsmooth.dir/MIDG-II.cxx.o
[  1%] Building CXX object utils/GPSsmooth/CMakeFiles/GPSsmooth.dir/GPSsmooth.cxx.o
[  1%] Building CXX object utils/GPSsmooth/CMakeFiles/UGsmooth.dir/UGear.cxx.o
Scanning dependencies of target fgelev
[  1%] Building C object 3rdparty/hts_engine_API/CMakeFiles/hts_engine.dir/lib/HTS_engine.c.o
[  1%] Building CXX object utils/fgelev/CMakeFiles/fgelev.dir/fgelev.cxx.o
Scanning dependencies of target fgpanel
[  1%] Building CXX object utils/fgpanel/CMakeFiles/fgpanel.dir/main.cxx.o
Scanning dependencies of target fgviewer
Scanning dependencies of target fgsqlite3
[  1%] Building CXX object utils/fgviewer/CMakeFiles/fgviewer.dir/fgviewer.cxx.o
Scanning dependencies of target iaxclient_lib
[  1%] Building C object 3rdparty/sqlite3/CMakeFiles/fgsqlite3.dir/sqlite3.c.o
Scanning dependencies of target flite_hts
[  1%] Building C object 3rdparty/iaxclient/lib/CMakeFiles/iaxclient_lib.dir/audio_encode.c.o
[  1%] Building C object 3rdparty/flite_hts_engine/CMakeFiles/flite_hts.dir/flite/src/hrg/cst_ffeature.c.o
[  1%] Building C object 3rdparty/flite_hts_engine/CMakeFiles/flite_hts.dir/flite/src/hrg/cst_item.c.o
[  1%] Building C object 3rdparty/iaxclient/lib/CMakeFiles/iaxclient_lib.dir/audio_file.c.o
[  1%] Linking CXX executable fgtraffic
[  1%] Building C object 3rdparty/iaxclient/lib/CMakeFiles/iaxclient_lib.dir/audio_openal.c.o
[  1%] Built target fgtraffic
[  1%] Building C object 3rdparty/hts_engine_API/CMakeFiles/hts_engine.dir/lib/HTS_gstream.c.o
Scanning dependencies of target fgrcc
[  1%] Building CXX object src/EmbeddedResources/CMakeFiles/fgrcc.dir/fgrcc.cxx.o
[  1%] Building C object 3rdparty/flite_hts_engine/CMakeFiles/flite_hts.dir/flite/src/hrg/cst_relation.c.o
[  1%] Building C object 3rdparty/flite_hts_engine/CMakeFiles/flite_hts.dir/flite/src/hrg/cst_utterance.c.o
[  3%] Building C object 3rdparty/iaxclient/lib/CMakeFiles/iaxclient_lib.dir/codec_alaw.c.o
[  3%] Building C object 3rdparty/hts_engine_API/CMakeFiles/hts_engine.dir/lib/HTS_label.c.o
[  3%] Building CXX object 3rdparty/joystick/CMakeFiles/PLIBJoystick.dir/jsLinux.cxx.o
[  3%] Building C object 3rdparty/flite_hts_engine/CMakeFiles/flite_hts.dir/flite/src/lexicon/cst_lexicon.c.o
[  3%] Building C object 3rdparty/iaxclient/lib/CMakeFiles/iaxclient_lib.dir/codec_gsm.c.o
[  3%] Building CXX object utils/GPSsmooth/CMakeFiles/GPSsmooth.dir/gps_main.cxx.o
[  3%] Building C object 3rdparty/hts_engine_API/CMakeFiles/hts_engine.dir/lib/HTS_misc.c.o
/home/chris/fg2019_2/flightgear/3rdparty/flite_hts_engine/flite/src/lexicon/cst_lexicon.c:93:12: warning: ‘no_syl_boundaries’ declared ‘static’ but never defined [-Wunused-function]
 static int no_syl_boundaries(const cst_item *i, const cst_val *p);
            ^
[  3%] Building C object 3rdparty/iaxclient/lib/CMakeFiles/iaxclient_lib.dir/codec_ulaw.c.o
[  3%] Building C object 3rdparty/flite_hts_engine/CMakeFiles/flite_hts.dir/flite/src/lexicon/cst_lts.c.o
[  3%] Building C object 3rdparty/hts_engine_API/CMakeFiles/hts_engine.dir/lib/HTS_model.c.o
[  3%] Building C object 3rdparty/flite_hts_engine/CMakeFiles/flite_hts.dir/flite/src/regex/cst_regex.c.o
[  3%] Building C object 3rdparty/iaxclient/lib/CMakeFiles/iaxclient_lib.dir/iaxclient_lib.c.o
[  3%] Building CXX object utils/fgpanel/CMakeFiles/fgpanel.dir/ApplicationProperties.cxx.o
[  3%] Building C object 3rdparty/flite_hts_engine/CMakeFiles/flite_hts.dir/flite/src/regex/regexp.c.o
[  3%] Linking CXX static library libPLIBJoystick.a
[  3%] Built target PLIBJoystick
Scanning dependencies of target fgqmlui_autogen
[  3%] Automatic MOC for target fgqmlui
[  3%] Building C object 3rdparty/flite_hts_engine/CMakeFiles/flite_hts.dir/flite/src/stats/cst_cart.c.o
[  3%] Building CXX object utils/GPSsmooth/CMakeFiles/MIDGsmooth.dir/MIDG_main.cxx.o
[  3%] Building C object 3rdparty/flite_hts_engine/CMakeFiles/flite_hts.dir/flite/src/synth/cst_ffeatures.c.o
[  3%] Building C object 3rdparty/iaxclient/lib/CMakeFiles/iaxclient_lib.dir/unixfuncs.c.o
[  3%] Building C object 3rdparty/iaxclient/lib/CMakeFiles/iaxclient_lib.dir/codec_speex.c.o
[  3%] Building C object 3rdparty/iaxclient/lib/CMakeFiles/iaxclient_lib.dir/spandsp/plc.c.o
[  3%] Building CXX object utils/fgpanel/CMakeFiles/fgpanel.dir/FGCroppedTexture.cxx.o
[  3%] Building C object 3rdparty/flite_hts_engine/CMakeFiles/flite_hts.dir/flite/src/synth/cst_phoneset.c.o
[  3%] Building CXX object utils/GPSsmooth/CMakeFiles/UGsmooth.dir/UGear_command.cxx.o
[  3%] Building C object 3rdparty/flite_hts_engine/CMakeFiles/flite_hts.dir/flite/src/synth/cst_synth.c.o
[  3%] Building C object 3rdparty/iaxclient/lib/CMakeFiles/iaxclient_lib.dir/gsm/src/add.c.o
/home/chris/fg2019_2/flightgear/3rdparty/flite_hts_engine/flite/src/synth/cst_synth.c:108:23: warning: ‘tokentosegs’ declared ‘static’ but never defined [-Wunused-function]
 static cst_utterance *tokentosegs(cst_utterance *u);
                       ^
[  3%] Building C object 3rdparty/hts_engine_API/CMakeFiles/hts_engine.dir/lib/HTS_pstream.c.o
[  3%] Building C object 3rdparty/iaxclient/lib/CMakeFiles/iaxclient_lib.dir/gsm/src/code.c.o
[  3%] Building C object 3rdparty/iaxclient/lib/CMakeFiles/iaxclient_lib.dir/gsm/src/debug.c.o
[  3%] Building C object 3rdparty/iaxclient/lib/CMakeFiles/iaxclient_lib.dir/gsm/src/decode.c.o
[  3%] Building C object 3rdparty/flite_hts_engine/CMakeFiles/flite_hts.dir/flite/src/synth/cst_utt_utils.c.o
[  3%] Linking CXX executable GPSsmooth
[  3%] Building C object 3rdparty/flite_hts_engine/CMakeFiles/flite_hts.dir/flite/src/synth/cst_voice.c.o
[  3%] Building C object 3rdparty/iaxclient/lib/CMakeFiles/iaxclient_lib.dir/gsm/src/gsm_create.c.o
[  3%] Building C object 3rdparty/iaxclient/lib/CMakeFiles/iaxclient_lib.dir/gsm/src/gsm_decode.c.o
[  5%] Building C object 3rdparty/flite_hts_engine/CMakeFiles/flite_hts.dir/flite/src/synth/flite.c.o
[  5%] Built target GPSsmooth
Scanning dependencies of target fglauncher_autogen
[  5%] Generating ui_SetupRootDialog.h
[  5%] Building C object 3rdparty/flite_hts_engine/CMakeFiles/flite_hts.dir/flite/src/utils/cst_alloc.c.o
[  5%] Building C object 3rdparty/iaxclient/lib/CMakeFiles/iaxclient_lib.dir/gsm/src/gsm_destroy.c.o
[  5%] Generating qrc_resources.cpp
[  5%] Building C object 3rdparty/flite_hts_engine/CMakeFiles/flite_hts.dir/flite/src/utils/cst_error.c.o
[  5%] Building C object 3rdparty/iaxclient/lib/CMakeFiles/iaxclient_lib.dir/gsm/src/gsm_encode.c.o
[  5%] Generating ui_InstallSceneryDialog.h
[  5%] Building C object 3rdparty/flite_hts_engine/CMakeFiles/flite_hts.dir/flite/src/utils/cst_features.c.o
[  6%] Automatic MOC for target fglauncher
[  8%] Building C object 3rdparty/iaxclient/lib/CMakeFiles/iaxclient_lib.dir/gsm/src/gsm_explode.c.o
[  8%] Building C object 3rdparty/flite_hts_engine/CMakeFiles/flite_hts.dir/flite/src/utils/cst_string.c.o
[  8%] Building C object 3rdparty/hts_engine_API/CMakeFiles/hts_engine.dir/lib/HTS_sstream.c.o
[  8%] Building C object 3rdparty/iaxclient/lib/CMakeFiles/iaxclient_lib.dir/gsm/src/gsm_implode.c.o
[  8%] Building C object 3rdparty/flite_hts_engine/CMakeFiles/flite_hts.dir/flite/src/utils/cst_tokenstream.c.o
/home/chris/fg2019_2/flightgear/3rdparty/flite_hts_engine/flite/src/utils/cst_tokenstream.c: In function ‘ts_get_quoted_token’:
/home/chris/fg2019_2/flightgear/3rdparty/flite_hts_engine/flite/src/utils/cst_tokenstream.c:386:9: warning: variable ‘l’ set but not used [-Wunused-but-set-variable]
     int l, p;
         ^
[  8%] Building CXX object utils/GPSsmooth/CMakeFiles/UGsmooth.dir/UGear_telnet.cxx.o
[  8%] Building C object 3rdparty/iaxclient/lib/CMakeFiles/iaxclient_lib.dir/gsm/src/gsm_option.c.o
[  8%] Building C object 3rdparty/iaxclient/lib/CMakeFiles/iaxclient_lib.dir/gsm/src/gsm_print.c.o
/home/chris/fg2019_2/flightgear/3rdparty/flite_hts_engine/flite/src/utils/cst_tokenstream.c: In function ‘ts_set_stream_pos’:
/home/chris/fg2019_2/flightgear/3rdparty/flite_hts_engine/flite/src/utils/cst_tokenstream.c:349:12: warning: ‘new_pos’ may be used uninitialized in this function [-Wmaybe-uninitialized]
     return ts->file_pos;
            ^
[  8%] Building C object 3rdparty/flite_hts_engine/CMakeFiles/flite_hts.dir/flite/src/utils/cst_val.c.o
[  8%] Building C object 3rdparty/hts_engine_API/CMakeFiles/hts_engine.dir/lib/HTS_vocoder.c.o
/home/chris/fg2019_2/flightgear/3rdparty/flite_hts_engine/flite/src/utils/cst_val.c: In function ‘cst_utf8_explode’:
/home/chris/fg2019_2/flightgear/3rdparty/flite_hts_engine/flite/src/utils/cst_val.c:520:12: warning: variable ‘l’ set but not used [-Wunused-but-set-variable]
     int i, l=0;
            ^
[  8%] Building C object 3rdparty/iaxclient/lib/CMakeFiles/iaxclient_lib.dir/gsm/src/long_term.c.o
[  8%] Building C object 3rdparty/iaxclient/lib/CMakeFiles/iaxclient_lib.dir/gsm/src/lpc.c.o
[  8%] Linking CXX executable MIDGsmooth
[  8%] Building C object 3rdparty/flite_hts_engine/CMakeFiles/flite_hts.dir/flite/src/utils/cst_val_const.c.o
[  8%] Building C object 3rdparty/flite_hts_engine/CMakeFiles/flite_hts.dir/flite/src/utils/cst_val_user.c.o
[  8%] Building C object 3rdparty/flite_hts_engine/CMakeFiles/flite_hts.dir/flite/lang/cmu_us_kal/cmu_us_kal.c.o
[  8%] Built target MIDGsmooth
[  8%] Building C object 3rdparty/iaxclient/lib/CMakeFiles/iaxclient_lib.dir/gsm/src/preprocess.c.o
Scanning dependencies of target fgjs
[  8%] Building CXX object utils/fgpanel/CMakeFiles/fgpanel.dir/FGDummyTextureLoader.cxx.o
[  8%] Building CXX object src/Input/CMakeFiles/fgjs.dir/fgjs.cxx.o
[  8%] Building C object 3rdparty/flite_hts_engine/CMakeFiles/flite_hts.dir/flite/lang/cmulex/cmu_lex.c.o
[  8%] Building C object 3rdparty/iaxclient/lib/CMakeFiles/iaxclient_lib.dir/gsm/src/rpe.c.o
/home/chris/fg2019_2/flightgear/3rdparty/flite_hts_engine/flite/lang/cmulex/cmu_lex.c: In function ‘cmu_lex_init’:
/home/chris/fg2019_2/flightgear/3rdparty/flite_hts_engine/flite/lang/cmulex/cmu_lex.c:359:18: warning: assignment discards ‘const’ qualifier from pointer target type [-Wdiscarded-qualifiers]
     cmu_lex.data = cmu_lex_data;
                  ^
[  8%] Linking C static library libhts_engine.a
[  8%] Built target hts_engine
[  8%] Building C object 3rdparty/flite_hts_engine/CMakeFiles/flite_hts.dir/flite/lang/cmulex/cmu_lex_data.c.o
Scanning dependencies of target js_demo
[  8%] Building CXX object src/Input/CMakeFiles/js_demo.dir/js_demo.cxx.o
[  8%] Building CXX object utils/GPSsmooth/CMakeFiles/UGsmooth.dir/UGear_main.cxx.o
[  8%] Building C object 3rdparty/iaxclient/lib/CMakeFiles/iaxclient_lib.dir/gsm/src/short_term.c.o
[  8%] Building CXX object utils/fgpanel/CMakeFiles/fgpanel.dir/FGFontCache.cxx.o
[  8%] Linking CXX executable js_demo
[  8%] Building C object 3rdparty/iaxclient/lib/CMakeFiles/iaxclient_lib.dir/gsm/src/table.c.o
[  8%] Building C object 3rdparty/iaxclient/lib/CMakeFiles/iaxclient_lib.dir/libspeex/bits.c.o
[  8%] Built target js_demo
[  8%] Building C object 3rdparty/iaxclient/lib/CMakeFiles/iaxclient_lib.dir/libspeex/cb_search.c.o
Scanning dependencies of target yasim-proptest
[  8%] Building CXX object src/FDM/YASim/CMakeFiles/yasim-proptest.dir/proptest.cpp.o
[  8%] Building C object 3rdparty/iaxclient/lib/CMakeFiles/iaxclient_lib.dir/libspeex/exc_10_16_table.c.o
[  8%] Building C object 3rdparty/flite_hts_engine/CMakeFiles/flite_hts.dir/flite/lang/cmulex/cmu_lex_entries.c.o
[  8%] Building C object 3rdparty/iaxclient/lib/CMakeFiles/iaxclient_lib.dir/libspeex/exc_10_32_table.c.o
[  8%] Building C object 3rdparty/iaxclient/lib/CMakeFiles/iaxclient_lib.dir/libspeex/exc_20_32_table.c.o
[  8%] Building C object 3rdparty/flite_hts_engine/CMakeFiles/flite_hts.dir/flite/lang/cmulex/cmu_lts_model.c.o
[ 10%] Building C object 3rdparty/iaxclient/lib/CMakeFiles/iaxclient_lib.dir/libspeex/exc_5_256_table.c.o
[ 10%] Building C object 3rdparty/iaxclient/lib/CMakeFiles/iaxclient_lib.dir/libspeex/exc_5_64_table.c.o
[ 10%] Building C object 3rdparty/iaxclient/lib/CMakeFiles/iaxclient_lib.dir/libspeex/exc_8_128_table.c.o
[ 10%] Building C object 3rdparty/iaxclient/lib/CMakeFiles/iaxclient_lib.dir/libspeex/filters.c.o
[ 10%] Linking CXX executable fgrcc
[ 10%] Built target fgqmlui_autogen
[ 10%] Building C object 3rdparty/iaxclient/lib/CMakeFiles/iaxclient_lib.dir/libspeex/gain_table.c.o
[ 10%] Building C object 3rdparty/iaxclient/lib/CMakeFiles/iaxclient_lib.dir/libspeex/gain_table_lbr.c.o
[ 10%] Building C object 3rdparty/iaxclient/lib/CMakeFiles/iaxclient_lib.dir/libspeex/hexc_10_32_table.c.o
Scanning dependencies of target yasim
[ 10%] Built target fgrcc
[ 10%] Building CXX object src/FDM/YASim/CMakeFiles/yasim.dir/yasim-test.cpp.o
[ 10%] Building C object 3rdparty/iaxclient/lib/CMakeFiles/iaxclient_lib.dir/libspeex/hexc_table.c.o
[ 11%] Building C object 3rdparty/flite_hts_engine/CMakeFiles/flite_hts.dir/flite/lang/cmulex/cmu_lts_rules.c.o
[ 11%] Building C object 3rdparty/iaxclient/lib/CMakeFiles/iaxclient_lib.dir/libspeex/high_lsp_tables.c.o
[ 11%] Building C object 3rdparty/iaxclient/lib/CMakeFiles/iaxclient_lib.dir/libspeex/jitter.c.o
[ 11%] Building C object 3rdparty/flite_hts_engine/CMakeFiles/flite_hts.dir/flite/lang/cmulex/cmu_postlex.c.o
[ 11%] Building CXX object src/Input/CMakeFiles/fgjs.dir/jsinput.cxx.o
[ 11%] Building C object 3rdparty/iaxclient/lib/CMakeFiles/iaxclient_lib.dir/libspeex/lbr_48k_tables.c.o
[ 11%] Building C object 3rdparty/flite_hts_engine/CMakeFiles/flite_hts.dir/flite/lang/usenglish/us_aswd.c.o
[ 11%] Building C object 3rdparty/iaxclient/lib/CMakeFiles/iaxclient_lib.dir/libspeex/lpc.c.o
In file included from /home/chris/fg2019_2/flightgear/src/FDM/YASim/proptest.cpp:8:0:
/home/chris/fg2019_2/flightgear/src/FDM/YASim/yasim-common.hpp:41:24: warning: ‘yasim::DEF_PROP_ELEVATOR_TRIM’ defined but not used [-Wunused-variable]
     static const char* DEF_PROP_ELEVATOR_TRIM = "/controls/flight/elevator-trim";
                        ^
[ 11%] Building CXX object utils/fgpanel/CMakeFiles/fgpanel.dir/FGGLApplication.cxx.o
[ 11%] Building C object 3rdparty/iaxclient/lib/CMakeFiles/iaxclient_lib.dir/libspeex/lsp.c.o
[ 11%] Building C object 3rdparty/flite_hts_engine/CMakeFiles/flite_hts.dir/flite/lang/usenglish/us_expand.c.o
[ 11%] Building CXX object src/FDM/YASim/CMakeFiles/yasim-proptest.dir/Airplane.cpp.o
[ 11%] Building C object 3rdparty/iaxclient/lib/CMakeFiles/iaxclient_lib.dir/libspeex/lsp_tables_nb.c.o
[ 13%] Building C object 3rdparty/iaxclient/lib/CMakeFiles/iaxclient_lib.dir/libspeex/ltp.c.o
[ 13%] Building C object 3rdparty/flite_hts_engine/CMakeFiles/flite_hts.dir/flite/lang/usenglish/us_ffeatures.c.o
Scanning dependencies of target JSBSim
[ 13%] Building CXX object src/FDM/JSBSim/CMakeFiles/JSBSim.dir/FGFDMExec.cpp.o
[ 13%] Building CXX object src/Input/CMakeFiles/fgjs.dir/jssuper.cxx.o
[ 13%] Linking CXX executable fgelev
[ 13%] Building CXX object utils/fgpanel/CMakeFiles/fgpanel.dir/FGGroupLayer.cxx.o
[ 13%] Building C object 3rdparty/iaxclient/lib/CMakeFiles/iaxclient_lib.dir/libspeex/math_approx.c.o
[ 13%] Building C object 3rdparty/iaxclient/lib/CMakeFiles/iaxclient_lib.dir/libspeex/mdf.c.o
[ 13%] Linking CXX executable fgjs
[ 13%] Building C object 3rdparty/flite_hts_engine/CMakeFiles/flite_hts.dir/flite/lang/usenglish/us_gpos.c.o
[ 13%] Linking CXX executable UGsmooth
[ 13%] Building C object 3rdparty/flite_hts_engine/CMakeFiles/flite_hts.dir/flite/lang/usenglish/us_int_accent_cart.c.o
[ 13%] Building C object 3rdparty/flite_hts_engine/CMakeFiles/flite_hts.dir/flite/lang/usenglish/us_int_tone_cart.c.o
[ 13%] Built target fgjs
[ 13%] Building C object 3rdparty/flite_hts_engine/CMakeFiles/flite_hts.dir/flite/lang/usenglish/us_nums_cart.c.o
Scanning dependencies of target metar
[ 13%] Building CXX object src/Main/CMakeFiles/metar.dir/metar_main.cxx.o
[ 13%] Built target UGsmooth
Scanning dependencies of target buildId
-- Found Git: /usr/bin/git (found version "2.7.4") 
[ 13%] Building C object 3rdparty/flite_hts_engine/CMakeFiles/flite_hts.dir/flite/lang/usenglish/us_phoneset.c.o
-- Git revision is a9761bb3bac9e9fed7e7577498f287a4532f65bb
[ 13%] Built target buildId
[ 13%] Building CXX object utils/fgpanel/CMakeFiles/fgpanel.dir/FGInstrumentLayer.cxx.o
[ 13%] Building C object 3rdparty/flite_hts_engine/CMakeFiles/flite_hts.dir/flite/lang/usenglish/us_phrasing_cart.c.o
[ 13%] Building C object 3rdparty/flite_hts_engine/CMakeFiles/flite_hts.dir/flite/lang/usenglish/us_pos_cart.c.o
[ 13%] Building C object 3rdparty/iaxclient/lib/CMakeFiles/iaxclient_lib.dir/libspeex/medfilter.c.o
[ 13%] Building C object 3rdparty/iaxclient/lib/CMakeFiles/iaxclient_lib.dir/libspeex/misc.c.o
[ 13%] Building C object 3rdparty/flite_hts_engine/CMakeFiles/flite_hts.dir/flite/lang/usenglish/us_text.c.o
[ 13%] Building CXX object utils/fgpanel/CMakeFiles/fgpanel.dir/FGLayeredInstrument.cxx.o
[ 13%] Building C object 3rdparty/iaxclient/lib/CMakeFiles/iaxclient_lib.dir/libspeex/modes.c.o
[ 13%] Building CXX object src/FDM/YASim/CMakeFiles/yasim.dir/Airplane.cpp.o
[ 13%] Built target fglauncher_autogen
[ 13%] Building C object 3rdparty/iaxclient/lib/CMakeFiles/iaxclient_lib.dir/libspeex/nb_celp.c.o
[ 13%] Building C object 3rdparty/flite_hts_engine/CMakeFiles/flite_hts.dir/flite/lang/usenglish/usenglish.c.o
[ 13%] Building C object 3rdparty/flite_hts_engine/CMakeFiles/flite_hts.dir/lib/flite_hts_engine.c.o
Scanning dependencies of target fgqmlui
[ 13%] Building CXX object src/GUI/CMakeFiles/fgqmlui.dir/fgqmlui_autogen/mocs_compilation.cpp.o
[ 13%] Building CXX object utils/fgpanel/CMakeFiles/fgpanel.dir/FGPanel.cxx.o
[ 15%] Linking C static library libflite_hts.a
[ 15%] Built target flite_hts
[ 15%] Building C object 3rdparty/iaxclient/lib/CMakeFiles/iaxclient_lib.dir/libspeex/preprocess.c.o
[ 16%] Building CXX object utils/fgpanel/CMakeFiles/fgpanel.dir/FGPanelApplication.cxx.o
[ 16%] Building CXX object src/FDM/YASim/CMakeFiles/yasim-proptest.dir/Atmosphere.cpp.o
[ 16%] Building CXX object utils/fgviewer/CMakeFiles/fgviewer.dir/Drawable.cxx.o
[ 16%] Built target fgelev
[ 16%] Building CXX object utils/fgviewer/CMakeFiles/fgviewer.dir/Renderer.cxx.o
[ 16%] Building C object 3rdparty/iaxclient/lib/CMakeFiles/iaxclient_lib.dir/libspeex/quant_lsp.c.o
Scanning dependencies of target fglauncher
[ 16%] Building CXX object src/FDM/YASim/CMakeFiles/yasim-proptest.dir/ControlMap.cpp.o
[ 16%] Building CXX object src/GUI/CMakeFiles/fglauncher.dir/fglauncher_autogen/mocs_compilation.cpp.o
[ 16%] Building C object 3rdparty/iaxclient/lib/CMakeFiles/iaxclient_lib.dir/libspeex/sb_celp.c.o
[ 16%] Building CXX object utils/fgpanel/CMakeFiles/fgpanel.dir/FGPanelInstrument.cxx.o
[ 16%] Building CXX object utils/fgpanel/CMakeFiles/fgpanel.dir/FGPanelProtocol.cxx.o
[ 16%] Building CXX object utils/fgpanel/CMakeFiles/fgpanel.dir/FGPanelTransformation.cxx.o
[ 16%] Building C object 3rdparty/iaxclient/lib/CMakeFiles/iaxclient_lib.dir/libspeex/smallft.c.o
[ 16%] Building CXX object src/FDM/YASim/CMakeFiles/yasim.dir/Atmosphere.cpp.o
[ 16%] Building CXX object src/FDM/YASim/CMakeFiles/yasim.dir/ControlMap.cpp.o
[ 16%] Building CXX object utils/fgpanel/CMakeFiles/fgpanel.dir/FGPNGTextureLoader.cxx.o
[ 16%] Linking CXX executable metar
[ 16%] Building C object 3rdparty/iaxclient/lib/CMakeFiles/iaxclient_lib.dir/libspeex/speex.c.o
In file included from /home/chris/fg2019_2/flightgear/src/FDM/YASim/Wing.hpp:4:0,
                 from /home/chris/fg2019_2/flightgear/src/FDM/YASim/ControlMap.cpp:15:
/home/chris/fg2019_2/flightgear/src/FDM/YASim/yasim-common.hpp:41:24: warning: ‘yasim::DEF_PROP_ELEVATOR_TRIM’ defined but not used [-Wunused-variable]
     static const char* DEF_PROP_ELEVATOR_TRIM = "/controls/flight/elevator-trim";
                        ^
[ 16%] Building C object 3rdparty/iaxclient/lib/CMakeFiles/iaxclient_lib.dir/libspeex/speex_callbacks.c.o
[ 16%] Building CXX object src/FDM/YASim/CMakeFiles/yasim-proptest.dir/FGFDM.cpp.o
[ 16%] Building C object 3rdparty/iaxclient/lib/CMakeFiles/iaxclient_lib.dir/libspeex/speex_header.c.o
/home/chris/fg2019_2/flightgear/utils/fgpanel/FGPNGTextureLoader.cxx: In member function ‘virtual GLuint FGPNGTextureLoader::loadTexture(const string&)’:
/home/chris/fg2019_2/flightgear/utils/fgpanel/FGPNGTextureLoader.cxx:56:27: warning: ignoring return value of ‘size_t fread(void*, size_t, size_t, FILE*)’, declared with attribute warn_unused_result [-Wunused-result]
   fread (header, 1, 8, fp);
                           ^
[ 16%] Building C object 3rdparty/iaxclient/lib/CMakeFiles/iaxclient_lib.dir/libspeex/stereo.c.o
[ 16%] Building CXX object utils/fgpanel/CMakeFiles/fgpanel.dir/FGSwitchLayer.cxx.o
[ 16%] Building CXX object utils/fgpanel/CMakeFiles/fgpanel.dir/FGRGBTextureLoader.cxx.o
[ 16%] Built target metar
[ 16%] Building CXX object utils/fgpanel/CMakeFiles/fgpanel.dir/FGTextLayer.cxx.o
[ 18%] Building C object 3rdparty/iaxclient/lib/CMakeFiles/iaxclient_lib.dir/libspeex/vbr.c.o
[ 18%] Building C object 3rdparty/iaxclient/lib/CMakeFiles/iaxclient_lib.dir/libspeex/vq.c.o
[ 18%] Building C object 3rdparty/iaxclient/lib/CMakeFiles/iaxclient_lib.dir/libiax2/src/iax.c.o
/home/chris/fg2019_2/flightgear/3rdparty/iaxclient/lib/libiax2/src/iax.c: In function ‘iax_transfer’:
/home/chris/fg2019_2/flightgear/3rdparty/iaxclient/lib/libiax2/src/iax.c:1354:13: warning: variable ‘res’ set but not used [-Wunused-but-set-variable]
  static int res;    //Return Code
             ^
[ 18%] Building CXX object utils/fgpanel/CMakeFiles/fgpanel.dir/FGTexturedLayer.cxx.o
[ 18%] Building CXX object utils/fgpanel/CMakeFiles/fgpanel.dir/panel_io.cxx.o
[ 18%] Building CXX object src/FDM/JSBSim/CMakeFiles/JSBSim.dir/FGJSBBase.cpp.o
In file included from /home/chris/fg2019_2/flightgear/src/FDM/YASim/Wing.hpp:4:0,
                 from /home/chris/fg2019_2/flightgear/src/FDM/YASim/ControlMap.cpp:15:
/home/chris/fg2019_2/flightgear/src/FDM/YASim/yasim-common.hpp:41:24: warning: ‘yasim::DEF_PROP_ELEVATOR_TRIM’ defined but not used [-Wunused-variable]
     static const char* DEF_PROP_ELEVATOR_TRIM = "/controls/flight/elevator-trim";
                        ^
[ 18%] Building CXX object src/FDM/YASim/CMakeFiles/yasim.dir/FGFDM.cpp.o
[ 18%] Building C object 3rdparty/iaxclient/lib/CMakeFiles/iaxclient_lib.dir/libiax2/src/iax2-parser.c.o
[ 18%] Building CXX object utils/fgpanel/CMakeFiles/fgpanel.dir/GL_utils.cxx.o
[ 18%] Building CXX object src/FDM/YASim/CMakeFiles/yasim-proptest.dir/Gear.cpp.o
[ 18%] Building C object 3rdparty/iaxclient/lib/CMakeFiles/iaxclient_lib.dir/libiax2/src/jitterbuf.c.o
[ 18%] Building C object 3rdparty/iaxclient/lib/CMakeFiles/iaxclient_lib.dir/libiax2/src/md5.c.o
[ 18%] Linking C static library libiaxclient_lib.a
[ 18%] Built target iaxclient_lib
Scanning dependencies of target fgcom
[ 18%] Building CXX object utils/fgcom/CMakeFiles/fgcom.dir/fgcom.cxx.o
[ 18%] Building CXX object src/GUI/CMakeFiles/fglauncher.dir/QtLauncher.cxx.o
[ 18%] Building CXX object src/FDM/JSBSim/CMakeFiles/JSBSim.dir/JSBSim.cxx.o
[ 18%] Building CXX object utils/fgviewer/CMakeFiles/fgviewer.dir/SlaveCamera.cxx.o
[ 18%] Building CXX object utils/fgviewer/CMakeFiles/fgviewer.dir/Viewer.cxx.o
In file included from /home/chris/fg2019_2/flightgear/src/FDM/YASim/FGFDM.cpp:11:0:
/home/chris/fg2019_2/flightgear/src/FDM/YASim/yasim-common.hpp:41:24: warning: ‘yasim::DEF_PROP_ELEVATOR_TRIM’ defined but not used [-Wunused-variable]
     static const char* DEF_PROP_ELEVATOR_TRIM = "/controls/flight/elevator-trim";
                        ^
[ 18%] Linking CXX executable fgpanel
[ 18%] Building CXX object src/FDM/YASim/CMakeFiles/yasim-proptest.dir/Glue.cpp.o
/usr/bin/ld: /usr/lib/gcc/x86_64-linux-gnu/5/../../../x86_64-linux-gnu/libGL.so: référence au symbole non défini « XextAddDisplay »
//usr/lib/x86_64-linux-gnu/libXext.so.6: error adding symbols: DSO manquant dans la ligne de commande
collect2: error: ld returned 1 exit status
utils/fgpanel/CMakeFiles/fgpanel.dir/build.make:394 : la recette pour la cible « utils/fgpanel/fgpanel » a échouée
make[2]: *** [utils/fgpanel/fgpanel] Erreur 1
CMakeFiles/Makefile2:688 : la recette pour la cible « utils/fgpanel/CMakeFiles/fgpanel.dir/all » a échouée
make[1]: *** [utils/fgpanel/CMakeFiles/fgpanel.dir/all] Erreur 2
make[1]: *** Attente des tâches non terminées....
[ 18%] Building CXX object src/FDM/YASim/CMakeFiles/yasim-proptest.dir/Ground.cpp.o
[ 18%] Building CXX object src/FDM/YASim/CMakeFiles/yasim-proptest.dir/Hitch.cpp.o
[ 18%] Building CXX object src/FDM/YASim/CMakeFiles/yasim-proptest.dir/Hook.cpp.o
[ 18%] Building CXX object src/FDM/YASim/CMakeFiles/yasim-proptest.dir/Integrator.cpp.o
[ 18%] Building CXX object src/GUI/CMakeFiles/fglauncher.dir/LauncherMainWindow.cxx.o
In file included from /home/chris/fg2019_2/flightgear/src/FDM/YASim/FGFDM.cpp:11:0:
/home/chris/fg2019_2/flightgear/src/FDM/YASim/yasim-common.hpp:41:24: warning: ‘yasim::DEF_PROP_ELEVATOR_TRIM’ defined but not used [-Wunused-variable]
     static const char* DEF_PROP_ELEVATOR_TRIM = "/controls/flight/elevator-trim";
                        ^
[ 18%] Building CXX object src/FDM/YASim/CMakeFiles/yasim-proptest.dir/Jet.cpp.o
[ 18%] Building CXX object src/FDM/YASim/CMakeFiles/yasim-proptest.dir/Launchbar.cpp.o
[ 18%] Building CXX object src/FDM/YASim/CMakeFiles/yasim.dir/Gear.cpp.o
[ 20%] Building CXX object src/FDM/YASim/CMakeFiles/yasim-proptest.dir/Model.cpp.o
[ 20%] Building CXX object src/FDM/YASim/CMakeFiles/yasim-proptest.dir/PistonEngine.cpp.o
[ 20%] Building CXX object src/FDM/YASim/CMakeFiles/yasim-proptest.dir/PropEngine.cpp.o
[ 20%] Building CXX object src/FDM/YASim/CMakeFiles/yasim-proptest.dir/Propeller.cpp.o
[ 20%] Building CXX object src/FDM/YASim/CMakeFiles/yasim-proptest.dir/RigidBody.cpp.o
[ 20%] Building CXX object src/GUI/CMakeFiles/fgqmlui.dir/QtQuickFGCanvasItem.cxx.o
[ 20%] Building CXX object src/GUI/CMakeFiles/fgqmlui.dir/QQuickDrawable.cxx.o
[ 20%] Building CXX object src/FDM/YASim/CMakeFiles/yasim.dir/Glue.cpp.o
In file included from /home/chris/fg2019_2/flightgear/src/FDM/YASim/Version.hpp:4:0,
                 from /home/chris/fg2019_2/flightgear/src/FDM/YASim/Surface.hpp:5,
                 from /home/chris/fg2019_2/flightgear/src/FDM/YASim/Model.cpp:16:
/home/chris/fg2019_2/flightgear/src/FDM/YASim/yasim-common.hpp:41:24: warning: ‘yasim::DEF_PROP_ELEVATOR_TRIM’ defined but not used [-Wunused-variable]
     static const char* DEF_PROP_ELEVATOR_TRIM = "/controls/flight/elevator-trim";
                        ^
[ 20%] Building CXX object src/FDM/YASim/CMakeFiles/yasim-proptest.dir/Rotor.cpp.o
[ 20%] Building CXX object src/FDM/YASim/CMakeFiles/yasim-proptest.dir/Rotorpart.cpp.o
[ 20%] Building CXX object src/FDM/YASim/CMakeFiles/yasim.dir/Ground.cpp.o
/home/chris/fg2019_2/flightgear/src/GUI/LauncherMainWindow.cxx: In constructor ‘LauncherMainWindow::LauncherMainWindow()’:
/home/chris/fg2019_2/flightgear/src/GUI/LauncherMainWindow.cxx:89:10: warning: unused variable ‘selector’ [-Wunused-variable]
     auto selector = new QQmlFileSelector(engine(), this);
          ^
[ 20%] Linking CXX executable fgcom
[ 20%] Building CXX object src/FDM/YASim/CMakeFiles/yasim.dir/Hitch.cpp.o
[ 20%] Built target fgcom
[ 20%] Building CXX object src/FDM/YASim/CMakeFiles/yasim.dir/Hook.cpp.o
[ 20%] Building CXX object src/GUI/CMakeFiles/fglauncher.dir/BaseDiagram.cxx.o
[ 20%] Building CXX object src/FDM/YASim/CMakeFiles/yasim-proptest.dir/SimpleJet.cpp.o
[ 20%] Building CXX object src/FDM/YASim/CMakeFiles/yasim.dir/Integrator.cpp.o
[ 20%] Building CXX object src/FDM/YASim/CMakeFiles/yasim-proptest.dir/Surface.cpp.o
[ 20%] Building CXX object src/FDM/JSBSim/CMakeFiles/JSBSim.dir/initialization/FGInitialCondition.cpp.o
[ 20%] Building CXX object src/FDM/YASim/CMakeFiles/yasim.dir/Jet.cpp.o
[ 20%] Building CXX object src/GUI/CMakeFiles/fglauncher.dir/AirportDiagram.cxx.o
[ 21%] Building CXX object src/FDM/YASim/CMakeFiles/yasim.dir/Launchbar.cpp.o
[ 21%] Building CXX object src/FDM/YASim/CMakeFiles/yasim.dir/Model.cpp.o
[ 21%] Building CXX object src/FDM/YASim/CMakeFiles/yasim-proptest.dir/TurbineEngine.cpp.o
[ 21%] Building CXX object src/FDM/YASim/CMakeFiles/yasim.dir/PistonEngine.cpp.o
[ 21%] Building CXX object src/FDM/YASim/CMakeFiles/yasim-proptest.dir/Turbulence.cpp.o
In file included from /home/chris/fg2019_2/flightgear/src/FDM/YASim/Surface.cpp:2:0:
/home/chris/fg2019_2/flightgear/src/FDM/YASim/yasim-common.hpp:41:24: warning: ‘yasim::DEF_PROP_ELEVATOR_TRIM’ defined but not used [-Wunused-variable]
     static const char* DEF_PROP_ELEVATOR_TRIM = "/controls/flight/elevator-trim";
                        ^
[ 21%] Building CXX object src/FDM/YASim/CMakeFiles/yasim.dir/PropEngine.cpp.o
[ 21%] Building CXX object src/FDM/YASim/CMakeFiles/yasim-proptest.dir/Wing.cpp.o
[ 21%] Building CXX object src/FDM/YASim/CMakeFiles/yasim-proptest.dir/Version.cpp.o
[ 21%] Building CXX object src/FDM/YASim/CMakeFiles/yasim.dir/Propeller.cpp.o
[ 21%] Building CXX object src/FDM/YASim/CMakeFiles/yasim.dir/RigidBody.cpp.o
[ 21%] Building CXX object src/FDM/YASim/CMakeFiles/yasim.dir/Rotor.cpp.o
In file included from /home/chris/fg2019_2/flightgear/src/FDM/YASim/Version.hpp:4:0,
                 from /home/chris/fg2019_2/flightgear/src/FDM/YASim/Surface.hpp:5,
                 from /home/chris/fg2019_2/flightgear/src/FDM/YASim/Model.cpp:16:
/home/chris/fg2019_2/flightgear/src/FDM/YASim/yasim-common.hpp:41:24: warning: ‘yasim::DEF_PROP_ELEVATOR_TRIM’ defined but not used [-Wunused-variable]
     static const char* DEF_PROP_ELEVATOR_TRIM = "/controls/flight/elevator-trim";
                        ^
[ 23%] Linking CXX executable fgviewer
[ 23%] Building CXX object src/FDM/YASim/CMakeFiles/yasim.dir/Rotorpart.cpp.o
[ 23%] Building CXX object src/FDM/YASim/CMakeFiles/yasim.dir/SimpleJet.cpp.o
In file included from /home/chris/fg2019_2/flightgear/src/FDM/YASim/Version.hpp:4:0,
                 from /home/chris/fg2019_2/flightgear/src/FDM/YASim/Version.cpp:5:
/home/chris/fg2019_2/flightgear/src/FDM/YASim/yasim-common.hpp:41:24: warning: ‘yasim::DEF_PROP_ELEVATOR_TRIM’ defined but not used [-Wunused-variable]
     static const char* DEF_PROP_ELEVATOR_TRIM = "/controls/flight/elevator-trim";
                        ^
[ 23%] Building CXX object src/FDM/YASim/CMakeFiles/yasim.dir/Surface.cpp.o
[ 23%] Building CXX object src/FDM/YASim/CMakeFiles/yasim-proptest.dir/yasim-common.cpp.o
In file included from /home/chris/fg2019_2/flightgear/src/FDM/YASim/Wing.cpp:1:0:
/home/chris/fg2019_2/flightgear/src/FDM/YASim/yasim-common.hpp:41:24: warning: ‘yasim::DEF_PROP_ELEVATOR_TRIM’ defined but not used [-Wunused-variable]
     static const char* DEF_PROP_ELEVATOR_TRIM = "/controls/flight/elevator-trim";
                        ^
[ 25%] Building CXX object src/GUI/CMakeFiles/fgqmlui.dir/PropertyItemModel.cxx.o
[ 25%] Building CXX object src/GUI/CMakeFiles/fgqmlui.dir/FGQmlInstance.cxx.o
In file included from /home/chris/fg2019_2/flightgear/src/FDM/YASim/yasim-common.cpp:1:0:
/home/chris/fg2019_2/flightgear/src/FDM/YASim/yasim-common.hpp:41:24: warning: ‘yasim::DEF_PROP_ELEVATOR_TRIM’ defined but not used [-Wunused-variable]
     static const char* DEF_PROP_ELEVATOR_TRIM = "/controls/flight/elevator-trim";
                        ^
[ 26%] Linking CXX executable yasim-proptest
[ 26%] Building CXX object src/FDM/YASim/CMakeFiles/yasim.dir/TurbineEngine.cpp.o
[ 26%] Building CXX object src/FDM/YASim/CMakeFiles/yasim.dir/Turbulence.cpp.o
[ 26%] Built target yasim-proptest
[ 26%] Building CXX object src/FDM/YASim/CMakeFiles/yasim.dir/Wing.cpp.o
[ 26%] Building CXX object src/FDM/YASim/CMakeFiles/yasim.dir/Version.cpp.o
In file included from /home/chris/fg2019_2/flightgear/src/FDM/YASim/Surface.cpp:2:0:
/home/chris/fg2019_2/flightgear/src/FDM/YASim/yasim-common.hpp:41:24: warning: ‘yasim::DEF_PROP_ELEVATOR_TRIM’ defined but not used [-Wunused-variable]
     static const char* DEF_PROP_ELEVATOR_TRIM = "/controls/flight/elevator-trim";
                        ^
[ 28%] Building CXX object src/FDM/YASim/CMakeFiles/yasim.dir/yasim-common.cpp.o
[ 28%] Built target fgviewer
[ 28%] Building CXX object src/GUI/CMakeFiles/fglauncher.dir/NavaidDiagram.cxx.o
/home/chris/fg2019_2/flightgear/src/GUI/PropertyItemModel.cxx: In member function ‘virtual QVariant PropertyItemModel::data(const QModelIndex&, int) const’:
/home/chris/fg2019_2/flightgear/src/GUI/PropertyItemModel.cxx:70:21: warning: comparison between signed and unsigned integer expressions [-Wsign-compare]
     if (index.row() >= _nodes.size())
                     ^
[ 28%] Building CXX object src/GUI/CMakeFiles/fglauncher.dir/SetupRootDialog.cxx.o
In file included from /home/chris/fg2019_2/flightgear/src/FDM/YASim/yasim-common.cpp:1:0:
/home/chris/fg2019_2/flightgear/src/FDM/YASim/yasim-common.hpp:41:24: warning: ‘yasim::DEF_PROP_ELEVATOR_TRIM’ defined but not used [-Wunused-variable]
     static const char* DEF_PROP_ELEVATOR_TRIM = "/controls/flight/elevator-trim";
                        ^
[ 28%] Building CXX object src/GUI/CMakeFiles/fglauncher.dir/AircraftModel.cxx.o
[ 28%] Building CXX object src/FDM/JSBSim/CMakeFiles/JSBSim.dir/initialization/FGTrim.cpp.o
[ 28%] Building CXX object src/GUI/CMakeFiles/fgqmlui.dir/FGQmlPropertyNode.cxx.o
[ 28%] Building CXX object src/GUI/CMakeFiles/fglauncher.dir/CatalogListModel.cxx.o
[ 28%] Building CXX object src/GUI/CMakeFiles/fgqmlui.dir/QmlAircraftInfo.cxx.o
In file included from /home/chris/fg2019_2/flightgear/src/FDM/YASim/Version.hpp:4:0,
                 from /home/chris/fg2019_2/flightgear/src/FDM/YASim/Version.cpp:5:
/home/chris/fg2019_2/flightgear/src/FDM/YASim/yasim-common.hpp:41:24: warning: ‘yasim::DEF_PROP_ELEVATOR_TRIM’ defined but not used [-Wunused-variable]
     static const char* DEF_PROP_ELEVATOR_TRIM = "/controls/flight/elevator-trim";
                        ^
[ 28%] Building CXX object src/GUI/CMakeFiles/fgqmlui.dir/LocalAircraftCache.cxx.o
In file included from /home/chris/fg2019_2/flightgear/src/FDM/YASim/Wing.cpp:1:0:
/home/chris/fg2019_2/flightgear/src/FDM/YASim/yasim-common.hpp:41:24: warning: ‘yasim::DEF_PROP_ELEVATOR_TRIM’ defined but not used [-Wunused-variable]
     static const char* DEF_PROP_ELEVATOR_TRIM = "/controls/flight/elevator-trim";
                        ^
[ 28%] Linking CXX executable yasim
[ 28%] Building CXX object src/GUI/CMakeFiles/fgqmlui.dir/PreviewImageItem.cxx.o
[ 28%] Building CXX object src/GUI/CMakeFiles/fglauncher.dir/QtMessageBox.cxx.o
[ 28%] Built target yasim
[ 28%] Building CXX object src/GUI/CMakeFiles/fglauncher.dir/QtFileDialog.cxx.o
[ 28%] Building CXX object src/GUI/CMakeFiles/fglauncher.dir/InstallSceneryDialog.cxx.o
[ 28%] Building CXX object src/GUI/CMakeFiles/fgqmlui.dir/ThumbnailImageItem.cxx.o
/home/chris/fg2019_2/flightgear/src/GUI/CatalogListModel.cxx: In member function ‘void CatalogListModel::removeCatalog(int)’:
/home/chris/fg2019_2/flightgear/src/GUI/CatalogListModel.cxx:177:31: warning: comparison between signed and unsigned integer expressions [-Wsign-compare]
     if ((index < 0) || (index >= m_catalogs.size())) {
                               ^
/home/chris/fg2019_2/flightgear/src/GUI/CatalogListModel.cxx: In member function ‘void CatalogListModel::refreshCatalog(int)’:
/home/chris/fg2019_2/flightgear/src/GUI/CatalogListModel.cxx:188:31: warning: comparison between signed and unsigned integer expressions [-Wsign-compare]
     if ((index < 0) || (index >= m_catalogs.size())) {
                               ^
[ 30%] Building CXX object src/GUI/CMakeFiles/fglauncher.dir/LocationController.cxx.o
[ 30%] Building CXX object src/FDM/JSBSim/CMakeFiles/JSBSim.dir/initialization/FGTrimAxis.cpp.o
[ 30%] Building CXX object src/GUI/CMakeFiles/fgqmlui.dir/PopupWindowTracker.cxx.o
[ 30%] Building CXX object src/GUI/CMakeFiles/fglauncher.dir/LauncherArgumentTokenizer.cxx.o
[ 30%] Building CXX object src/GUI/CMakeFiles/fglauncher.dir/AircraftSearchFilterModel.cxx.o
[ 30%] Building CXX object src/GUI/CMakeFiles/fgqmlui.dir/QmlPositioned.cxx.o
[ 30%] Building CXX object src/GUI/CMakeFiles/fglauncher.dir/DefaultAircraftLocator.cxx.o
[ 31%] Building CXX object src/FDM/JSBSim/CMakeFiles/JSBSim.dir/input_output/FGGroundCallback.cpp.o
[ 31%] Building CXX object src/GUI/CMakeFiles/fgqmlui.dir/QmlNavCacheWrapper.cxx.o
[ 31%] Building CXX object src/FDM/JSBSim/CMakeFiles/JSBSim.dir/input_output/FGPropertyReader.cpp.o
[ 31%] Linking C static library libfgsqlite3.a
[ 31%] Building CXX object src/GUI/CMakeFiles/fglauncher.dir/LaunchConfig.cxx.o
[ 31%] Built target fgsqlite3
[ 31%] Building CXX object src/GUI/CMakeFiles/fglauncher.dir/MPServersModel.cpp.o
[ 31%] Building CXX object src/GUI/CMakeFiles/fglauncher.dir/PathUrlHelper.cxx.o
[ 31%] Building CXX object src/GUI/CMakeFiles/fglauncher.dir/RecentAircraftModel.cxx.o
[ 31%] Building CXX object src/GUI/CMakeFiles/fgqmlui.dir/QmlRadioButtonHelper.cxx.o
/home/chris/fg2019_2/flightgear/src/GUI/DefaultAircraftLocator.cxx: In member function ‘virtual QVariant flightgear::WeatherScenariosModel::data(const QModelIndex&, int) const’:
/home/chris/fg2019_2/flightgear/src/GUI/DefaultAircraftLocator.cxx:123:27: warning: comparison between signed and unsigned integer expressions [-Wsign-compare]
     if ((row < 0) || (row >= m_scenarios.size())) {
                           ^
[ 31%] Building CXX object src/GUI/CMakeFiles/fgqmlui.dir/UnitsModel.cxx.o
[ 31%] Building CXX object src/GUI/CMakeFiles/fgqmlui.dir/NavaidSearchModel.cxx.o
[ 31%] Building CXX object src/GUI/CMakeFiles/fgqmlui.dir/FlightPlanController.cxx.o
[ 31%] Building CXX object src/FDM/JSBSim/CMakeFiles/JSBSim.dir/input_output/FGPropertyManager.cpp.o
[ 31%] Building CXX object src/GUI/CMakeFiles/fglauncher.dir/RecentLocationsModel.cxx.o
[ 31%] Building CXX object src/GUI/CMakeFiles/fglauncher.dir/LauncherController.cxx.o
/home/chris/fg2019_2/flightgear/src/GUI/MPServersModel.cpp: In member function ‘QString MPServersModel::currentServer() const’:
/home/chris/fg2019_2/flightgear/src/GUI/MPServersModel.cpp:184:24: warning: comparison between signed and unsigned integer expressions [-Wsign-compare]
     if (m_currentIndex == m_servers.size()) {
                        ^
[ 31%] Building CXX object src/GUI/CMakeFiles/fglauncher.dir/AddOnsController.cxx.o
/home/chris/fg2019_2/flightgear/src/GUI/UnitsModel.cxx: In member function ‘virtual QVariant UnitsModel::data(const QModelIndex&, int) const’:
/home/chris/fg2019_2/flightgear/src/GUI/UnitsModel.cxx:129:27: warning: comparison between signed and unsigned integer expressions [-Wsign-compare]
     if ((row < 0) || (row >= m_enabledUnits.size()))
                           ^
/home/chris/fg2019_2/flightgear/src/GUI/UnitsModel.cxx: In member function ‘void UnitsModel::setSelectedIndex(int)’:
/home/chris/fg2019_2/flightgear/src/GUI/UnitsModel.cxx:270:23: warning: comparison between signed and unsigned integer expressions [-Wsign-compare]
     if (m_activeIndex == selectedIndex)
                       ^
/home/chris/fg2019_2/flightgear/src/GUI/UnitsModel.cxx:273:47: warning: comparison between signed and unsigned integer expressions [-Wsign-compare]
     if ((selectedIndex < 0) || (selectedIndex >= m_enabledUnits.size()))
                                               ^
[ 33%] Building CXX object src/GUI/CMakeFiles/fgqmlui.dir/RouteDiagram.cxx.o
[ 33%] Building CXX object src/GUI/CMakeFiles/fglauncher.dir/AddonsModel.cxx.o
[ 33%] Building CXX object src/GUI/CMakeFiles/fglauncher.dir/PixmapImageItem.cxx.o
[ 33%] Building CXX object src/FDM/JSBSim/CMakeFiles/JSBSim.dir/input_output/FGScript.cpp.o
[ 33%] Building CXX object src/GUI/CMakeFiles/fglauncher.dir/qrc_resources.cpp.o
[ 33%] Building CXX object src/GUI/CMakeFiles/fgqmlui.dir/ModelDataExtractor.cxx.o
[ 33%] Building CXX object src/FDM/JSBSim/CMakeFiles/JSBSim.dir/input_output/FGXMLElement.cpp.o
[ 33%] Building CXX object src/FDM/JSBSim/CMakeFiles/JSBSim.dir/input_output/FGXMLParse.cpp.o
/home/chris/fg2019_2/flightgear/src/GUI/NavaidSearchModel.cxx: In member function ‘qlonglong NavaidSearchModel::guidAtIndex(int) const’:
/home/chris/fg2019_2/flightgear/src/GUI/NavaidSearchModel.cxx:153:31: warning: comparison between signed and unsigned integer expressions [-Wsign-compare]
     if ((index < 0) || (index >= m_ids.size()))
                               ^
[ 33%] Building CXX object src/FDM/JSBSim/CMakeFiles/JSBSim.dir/input_output/FGfdmSocket.cpp.o
[ 33%] Building CXX object src/FDM/JSBSim/CMakeFiles/JSBSim.dir/input_output/FGInputType.cpp.o
[ 33%] Building CXX object src/FDM/JSBSim/CMakeFiles/JSBSim.dir/input_output/FGInputSocket.cpp.o
[ 33%] Building CXX object src/FDM/JSBSim/CMakeFiles/JSBSim.dir/input_output/FGUDPInputSocket.cpp.o
[ 33%] Building CXX object src/FDM/JSBSim/CMakeFiles/JSBSim.dir/input_output/FGOutputFG.cpp.o
[ 33%] Building CXX object src/FDM/JSBSim/CMakeFiles/JSBSim.dir/input_output/FGOutputFile.cpp.o
[ 33%] Building CXX object src/FDM/JSBSim/CMakeFiles/JSBSim.dir/input_output/FGOutputSocket.cpp.o
[ 33%] Building CXX object src/FDM/JSBSim/CMakeFiles/JSBSim.dir/input_output/FGOutputTextFile.cpp.o
[ 33%] Linking CXX static library libfgqmlui.a
[ 33%] Built target fgqmlui
[ 35%] Building CXX object src/FDM/JSBSim/CMakeFiles/JSBSim.dir/input_output/FGOutputType.cpp.o
[ 35%] Building CXX object src/FDM/JSBSim/CMakeFiles/JSBSim.dir/input_output/FGModelLoader.cpp.o
[ 35%] Building CXX object src/FDM/JSBSim/CMakeFiles/JSBSim.dir/math/FGColumnVector3.cpp.o
[ 35%] Building CXX object src/FDM/JSBSim/CMakeFiles/JSBSim.dir/math/FGCondition.cpp.o
[ 35%] Building CXX object src/FDM/JSBSim/CMakeFiles/JSBSim.dir/math/FGFunction.cpp.o
[ 35%] Building CXX object src/FDM/JSBSim/CMakeFiles/JSBSim.dir/math/FGLocation.cpp.o
[ 35%] Building CXX object src/FDM/JSBSim/CMakeFiles/JSBSim.dir/math/FGMatrix33.cpp.o
[ 35%] Building CXX object src/FDM/JSBSim/CMakeFiles/JSBSim.dir/math/FGModelFunctions.cpp.o
[ 35%] Building CXX object src/FDM/JSBSim/CMakeFiles/JSBSim.dir/math/FGPropertyValue.cpp.o
[ 35%] Building CXX object src/FDM/JSBSim/CMakeFiles/JSBSim.dir/math/FGQuaternion.cpp.o
[ 35%] Building CXX object src/FDM/JSBSim/CMakeFiles/JSBSim.dir/math/FGRealValue.cpp.o
[ 35%] Building CXX object src/FDM/JSBSim/CMakeFiles/JSBSim.dir/math/FGRungeKutta.cpp.o
[ 35%] Building CXX object src/FDM/JSBSim/CMakeFiles/JSBSim.dir/math/FGTable.cpp.o
[ 35%] Building CXX object src/FDM/JSBSim/CMakeFiles/JSBSim.dir/math/FGTemplateFunc.cpp.o
[ 35%] Building CXX object src/FDM/JSBSim/CMakeFiles/JSBSim.dir/models/FGAccelerations.cpp.o
[ 36%] Building CXX object src/FDM/JSBSim/CMakeFiles/JSBSim.dir/models/FGAerodynamics.cpp.o
[ 36%] Building CXX object src/FDM/JSBSim/CMakeFiles/JSBSim.dir/models/FGAircraft.cpp.o
[ 36%] Building CXX object src/FDM/JSBSim/CMakeFiles/JSBSim.dir/models/FGAtmosphere.cpp.o
[ 36%] Building CXX object src/FDM/JSBSim/CMakeFiles/JSBSim.dir/models/FGAuxiliary.cpp.o
[ 36%] Building CXX object src/FDM/JSBSim/CMakeFiles/JSBSim.dir/models/FGBuoyantForces.cpp.o
[ 36%] Building CXX object src/FDM/JSBSim/CMakeFiles/JSBSim.dir/models/FGExternalForce.cpp.o
[ 36%] Building CXX object src/FDM/JSBSim/CMakeFiles/JSBSim.dir/models/FGExternalReactions.cpp.o
[ 36%] Linking CXX static library libfglauncher.a
[ 38%] Built target fglauncher
[ 38%] Building CXX object src/FDM/JSBSim/CMakeFiles/JSBSim.dir/models/FGFCS.cpp.o
[ 38%] Building CXX object src/FDM/JSBSim/CMakeFiles/JSBSim.dir/models/FGGasCell.cpp.o
[ 38%] Building CXX object src/FDM/JSBSim/CMakeFiles/JSBSim.dir/models/FGSurface.cpp.o
[ 38%] Building CXX object src/FDM/JSBSim/CMakeFiles/JSBSim.dir/models/FGGroundReactions.cpp.o
[ 38%] Building CXX object src/FDM/JSBSim/CMakeFiles/JSBSim.dir/models/FGInertial.cpp.o
[ 38%] Building CXX object src/FDM/JSBSim/CMakeFiles/JSBSim.dir/models/FGInput.cpp.o
[ 38%] Building CXX object src/FDM/JSBSim/CMakeFiles/JSBSim.dir/models/FGLGear.cpp.o
[ 38%] Building CXX object src/FDM/JSBSim/CMakeFiles/JSBSim.dir/models/FGMassBalance.cpp.o
[ 40%] Building CXX object src/FDM/JSBSim/CMakeFiles/JSBSim.dir/models/FGModel.cpp.o
[ 40%] Building CXX object src/FDM/JSBSim/CMakeFiles/JSBSim.dir/models/FGOutput.cpp.o
[ 40%] Building CXX object src/FDM/JSBSim/CMakeFiles/JSBSim.dir/models/FGPropagate.cpp.o
[ 40%] Building CXX object src/FDM/JSBSim/CMakeFiles/JSBSim.dir/models/FGPropulsion.cpp.o
[ 40%] Building CXX object src/FDM/JSBSim/CMakeFiles/JSBSim.dir/models/atmosphere/FGMSIS.cpp.o
[ 40%] Building CXX object src/FDM/JSBSim/CMakeFiles/JSBSim.dir/models/atmosphere/FGMSISData.cpp.o
[ 40%] Building CXX object src/FDM/JSBSim/CMakeFiles/JSBSim.dir/models/atmosphere/FGStandardAtmosphere.cpp.o
[ 40%] Building CXX object src/FDM/JSBSim/CMakeFiles/JSBSim.dir/models/atmosphere/FGMars.cpp.o
[ 40%] Building CXX object src/FDM/JSBSim/CMakeFiles/JSBSim.dir/models/atmosphere/FGWinds.cpp.o
[ 40%] Building CXX object src/FDM/JSBSim/CMakeFiles/JSBSim.dir/models/flight_control/FGAccelerometer.cpp.o
[ 40%] Building CXX object src/FDM/JSBSim/CMakeFiles/JSBSim.dir/models/flight_control/FGActuator.cpp.o
[ 40%] Building CXX object src/FDM/JSBSim/CMakeFiles/JSBSim.dir/models/flight_control/FGAngles.cpp.o
[ 40%] Building CXX object src/FDM/JSBSim/CMakeFiles/JSBSim.dir/models/flight_control/FGDeadBand.cpp.o
[ 40%] Building CXX object src/FDM/JSBSim/CMakeFiles/JSBSim.dir/models/flight_control/FGFCSComponent.cpp.o
[ 41%] Building CXX object src/FDM/JSBSim/CMakeFiles/JSBSim.dir/models/flight_control/FGFCSFunction.cpp.o
[ 41%] Building CXX object src/FDM/JSBSim/CMakeFiles/JSBSim.dir/models/flight_control/FGFilter.cpp.o
[ 41%] Building CXX object src/FDM/JSBSim/CMakeFiles/JSBSim.dir/models/flight_control/FGGain.cpp.o
[ 41%] Building CXX object src/FDM/JSBSim/CMakeFiles/JSBSim.dir/models/flight_control/FGGyro.cpp.o
[ 41%] Building CXX object src/FDM/JSBSim/CMakeFiles/JSBSim.dir/models/flight_control/FGKinemat.cpp.o
[ 41%] Building CXX object src/FDM/JSBSim/CMakeFiles/JSBSim.dir/models/flight_control/FGMagnetometer.cpp.o
[ 41%] Building CXX object src/FDM/JSBSim/CMakeFiles/JSBSim.dir/models/flight_control/FGPID.cpp.o
[ 41%] Building CXX object src/FDM/JSBSim/CMakeFiles/JSBSim.dir/models/flight_control/FGSensor.cpp.o
[ 41%] Building CXX object src/FDM/JSBSim/CMakeFiles/JSBSim.dir/models/flight_control/FGSummer.cpp.o
[ 41%] Building CXX object src/FDM/JSBSim/CMakeFiles/JSBSim.dir/models/flight_control/FGSwitch.cpp.o
[ 41%] Building CXX object src/FDM/JSBSim/CMakeFiles/JSBSim.dir/models/flight_control/FGWaypoint.cpp.o
[ 41%] Building CXX object src/FDM/JSBSim/CMakeFiles/JSBSim.dir/models/flight_control/FGDistributor.cpp.o
[ 41%] Building CXX object src/FDM/JSBSim/CMakeFiles/JSBSim.dir/models/flight_control/FGLinearActuator.cpp.o
[ 41%] Building CXX object src/FDM/JSBSim/CMakeFiles/JSBSim.dir/models/propulsion/FGElectric.cpp.o
[ 41%] Building CXX object src/FDM/JSBSim/CMakeFiles/JSBSim.dir/models/propulsion/FGEngine.cpp.o
[ 43%] Building CXX object src/FDM/JSBSim/CMakeFiles/JSBSim.dir/models/propulsion/FGForce.cpp.o
[ 43%] Building CXX object src/FDM/JSBSim/CMakeFiles/JSBSim.dir/models/propulsion/FGNozzle.cpp.o
[ 43%] Building CXX object src/FDM/JSBSim/CMakeFiles/JSBSim.dir/models/propulsion/FGPiston.cpp.o
[ 43%] Building CXX object src/FDM/JSBSim/CMakeFiles/JSBSim.dir/models/propulsion/FGPropeller.cpp.o
[ 43%] Building CXX object src/FDM/JSBSim/CMakeFiles/JSBSim.dir/models/propulsion/FGRocket.cpp.o
[ 43%] Building CXX object src/FDM/JSBSim/CMakeFiles/JSBSim.dir/models/propulsion/FGRotor.cpp.o
[ 43%] Building CXX object src/FDM/JSBSim/CMakeFiles/JSBSim.dir/models/propulsion/FGTank.cpp.o
[ 43%] Building CXX object src/FDM/JSBSim/CMakeFiles/JSBSim.dir/models/propulsion/FGThruster.cpp.o
[ 43%] Building CXX object src/FDM/JSBSim/CMakeFiles/JSBSim.dir/models/propulsion/FGTransmission.cpp.o
[ 43%] Building CXX object src/FDM/JSBSim/CMakeFiles/JSBSim.dir/models/propulsion/FGTurbine.cpp.o
[ 43%] Building CXX object src/FDM/JSBSim/CMakeFiles/JSBSim.dir/models/propulsion/FGTurboProp.cpp.o
[ 43%] Linking CXX static library libJSBSim.a
[ 43%] Built target JSBSim
Makefile:162 : la recette pour la cible « all » a échouée
make: *** [all] Erreur 2
INSTALL flightgear
[  0%] Built target fgsqlite3
[  8%] Built target iaxclient_lib
[ 13%] Built target flite_hts
[ 13%] Built target hts_engine
[ 13%] Built target PLIBJoystick
[ 13%] Built target fgelev
[ 13%] Linking CXX executable fgpanel
/usr/bin/ld: /usr/lib/gcc/x86_64-linux-gnu/5/../../../x86_64-linux-gnu/libGL.so: référence au symbole non défini « XextAddDisplay »
//usr/lib/x86_64-linux-gnu/libXext.so.6: error adding symbols: DSO manquant dans la ligne de commande
collect2: error: ld returned 1 exit status
utils/fgpanel/CMakeFiles/fgpanel.dir/build.make:394 : la recette pour la cible « utils/fgpanel/fgpanel » a échouée
make[2]: *** [utils/fgpanel/fgpanel] Erreur 1
CMakeFiles/Makefile2:688 : la recette pour la cible « utils/fgpanel/CMakeFiles/fgpanel.dir/all » a échouée
make[1]: *** [utils/fgpanel/CMakeFiles/fgpanel.dir/all] Erreur 2
Makefile:162 : la recette pour la cible « all » a échouée
make: *** [all] Erreur 2
***********************************
All optional package alternatives have found a matching package.

Fg 2019.2.0 - LinuxMint 19.1 Tessa - CM Asus P8H67 MLE - CPU i3 2100T - 12 Go Ram - Nvidia Geforce GTX 770 - Driver Nvidia 430.26
+ Hp notebook-15-da0118nf -  CPU i3-7020u - Ram 4Go - Intel Graphics 620.

Hors ligne

#2 19/03/2019 11:21:32

f-toro
Administrateur
Lieu : LFLA
Inscription : 16/12/2007
Messages : 2 522

Re : Erreur compilation FGFS

Bonjour.

Le paquet libxext-dev est-il bien installé ?

Quelle est la version du paquet libxext ? libxext6 ?

Ta signature est-elle toujours à jour ?

Si oui, il est bien connu que des paquets un peu anciens provoquent des erreurs de compilation dans FG.
Surtout que la compilation tentait à te faire passer en 2019.2.0 .
Or tu sembles être encore en LM 18.
Pourquoi ne passes-tu pas en LM 19 ?


André. anciennement taureau89_9
Debian Testing Amd64. CM Sabertooth 990FX, FX8350, 32 Go Ram DDR3 1866 Mhz, GTX 750ti 2Go, DD 2To Sata 3, THRUSTMASTER T.Flight StickX, FG 2019.2.0 Git.

Hors ligne

#3 19/03/2019 12:02:14

Clm76
Membre
Lieu : LFOH
Inscription : 22/10/2012
Messages : 1 048

Re : Erreur compilation FGFS

ctesc356 a écrit :

Le paquet libxext-dev est-il bien installé ?

Oui. version 2:1.3.3-1

ctesc356 a écrit :

Quelle est la version du paquet libxext ? libxext6 ?

libxext6 version 2:1.3.3-1

ctesc356 a écrit :

Ta signature est-elle toujours à jour ?

Oui. J'avais essayé LM19 sur un portable de test mais je crois me souvenir avoir eu quelques problèmes avec des périphériques. Je suis donc resté en LM18 sur ma machine principale.


Fg 2019.2.0 - LinuxMint 19.1 Tessa - CM Asus P8H67 MLE - CPU i3 2100T - 12 Go Ram - Nvidia Geforce GTX 770 - Driver Nvidia 430.26
+ Hp notebook-15-da0118nf -  CPU i3-7020u - Ram 4Go - Intel Graphics 620.

Hors ligne

#4 19/03/2019 12:30:55

f-toro
Administrateur
Lieu : LFLA
Inscription : 16/12/2007
Messages : 2 522

Re : Erreur compilation FGFS

Tu te trompes d'interlocuteur.

Ce n'est pas

ctesc356 a écrit :

...

mais

f-toro a écrit :

...

Clm76 a écrit :

Je suis donc resté en LM18 sur ma machine principale.

Oui, mais ce n'est pas une raison valable.

Jusqu'à quand comptes-tu rester en LM 18 ?

Jusqu'à la LM 25 ?

Je ne serais pas étonné que ce soit ça le problème.


André. anciennement taureau89_9
Debian Testing Amd64. CM Sabertooth 990FX, FX8350, 32 Go Ram DDR3 1866 Mhz, GTX 750ti 2Go, DD 2To Sata 3, THRUSTMASTER T.Flight StickX, FG 2019.2.0 Git.

Hors ligne

#5 19/03/2019 12:37:17

ctesc356
Membre
Inscription : 18/05/2010
Messages : 2 745

Re : Erreur compilation FGFS

Bonjour,

Clm76 a écrit :

ctesc356 a écrit :
    Le paquet libxext-dev est-il bien installé ?

Jamais de la vie j'ai écrit ça wink

Je n'ai pas ce chemin: /usr/lib/gcc/x86_64-linux-gnu/5/../../../x86_64-linux-gnu/libGL.so
(mint 19.1, mais regardes en 18?)

Une chose m'interpelle: pourquoi compiler Cmake?
Ce n'est pas nécessaire, il y a quelque temps on avait un souci de version mais c'est révolu.

J'essaierais une compilation sans Cmake, juste PLIB SIMGEAR FGFS

Et Aussi, OpenRTI est inutile, aucune fonction fg ne l'utilise pour le moment, surtout que nous compilons fg avec:

RTI: DISABLED

Dernière modification par ctesc356 (19/03/2019 12:51:44)


Intel i5 3570 3.4Mhz, Nvidia GTX 660, 8Go Ram, Linux Mint

Hors ligne

#6 19/03/2019 12:47:01

Clm76
Membre
Lieu : LFOH
Inscription : 22/10/2012
Messages : 1 048

Re : Erreur compilation FGFS

ctesc356 a écrit :

Jamais de la vie j'ai écrit ça

Oups, désolé pour toi et f-toro wink Voilà ce qui arrive quand on fait plusieurs choses en même temps !...

ctesc356 a écrit :

J'essaierais une compilation sans Cmake, juste PLIB SIMGEAR FGFS

J'essaie de suite.


Fg 2019.2.0 - LinuxMint 19.1 Tessa - CM Asus P8H67 MLE - CPU i3 2100T - 12 Go Ram - Nvidia Geforce GTX 770 - Driver Nvidia 430.26
+ Hp notebook-15-da0118nf -  CPU i3-7020u - Ram 4Go - Intel Graphics 620.

Hors ligne

#7 19/03/2019 19:22:40

f-toro
Administrateur
Lieu : LFLA
Inscription : 16/12/2007
Messages : 2 522

Re : Erreur compilation FGFS

Clm76 a écrit :

Compilation complète de ce matin dans un nouveau répertoire (fg2019_2) :
PLIB : ok
CMAKE : ok
OPENRTI : ok
OSG : ok
SIMGEAR : ok
FGFS : plusieurs erreurs. Voici le log :

Oups ctesc356 a raison (comme dab), j'avais regardé le log mais pas fait attention au début du message.

Attention, avant de recompiler, il faut vider entièrement le nouveau répertoire fg2019_2, sauf le script d&c (et éventuellement le data).
Sinon la nouvelle compilation tiendra encore compte des version compilées inutiles.

Clm76 a écrit :

Oups, désolé pour toi et f-toro wink Voilà ce qui arrive quand on fait plusieurs choses en même temps !...

Si tu utilisais le bouton "Citer", cela ne ne produirait pas, au lieu d'utiliser la balise quote manuellement.

Tout ceci n'empêche pas de ne pas rester indéfiniment en LM18, mais de passer en LM19.


André. anciennement taureau89_9
Debian Testing Amd64. CM Sabertooth 990FX, FX8350, 32 Go Ram DDR3 1866 Mhz, GTX 750ti 2Go, DD 2To Sata 3, THRUSTMASTER T.Flight StickX, FG 2019.2.0 Git.

Hors ligne

#8 19/03/2019 20:33:25

Clm76
Membre
Lieu : LFOH
Inscription : 22/10/2012
Messages : 1 048

Re : Erreur compilation FGFS

Résultat de mes compilations de ce soir :
1 - Compilation PLIB SIMGEAR FGFS sur ma version 2018.4 que j'utilise actuellement : Tout est ok et fonctionne (version affichée 2019.2) malgré une erreur lors de la compilation de FGFS :

-- Found PkgConfig: /usr/bin/pkg-config (found version "0.29.1") 
-- Checking for module 'dbus-1'
--   Found dbus-1, version 1.10.6
-- Using DBus
-- Qt launcher enabled, checking for Qt >= 5.4 / qmake
-- Will enable Qt launcher GUI
--   Qt5Widgets version: 5.5.1
--   Qt5Widgets include dir: /usr/include/x86_64-linux-gnu/qt5/;/usr/include/x86_64-linux-gnu/qt5/QtWidgets;/usr/include/x86_64-linux-gnu/qt5/QtGui;/usr/include/x86_64-linux-gnu/qt5/QtCore;/usr/lib/x86_64-linux-gnu/qt5//mkspecs/linux-g++-64;/usr/include
-- Couldn't find translations data, will not include translated string in the executable
-- Could NOT find Qt5LinguistTools (missing: Qt5LinguistTools_DIR)
CMake Warning at CMakeModules/Translations.cmake:18 (find_package):
  Found package configuration file:

    /usr/lib/x86_64-linux-gnu/cmake/Qt5/Qt5Config.cmake

  but it set Qt5_FOUND to FALSE so package "Qt5" is considered to be NOT
  FOUND.  Reason given by package:

  Failed to find Qt5 component "LinguistTools" config file at
  "/usr/lib/x86_64-linux-gnu/cmake/Qt5LinguistTools/Qt5LinguistToolsConfig.cmake"

2 - Compilation dans un répertoire vierge : CMAKE PLIB OSG SIMGEAR FGFS et là, ça coince au niveau JSBSim puis fgpanel.

./download_and_compile.sh FGFS
VERSION=$Id
APT_GET_UPDATE=y
DOWNLOAD_PACKAGES=y
COMPILE=y
RECONFIGURE=y
DOWNLOAD=y
JOPTION= -j12 
OOPTION=
BUILD_TYPE=RelWithDebInfo
***********************************
Considering a package alternative: libcurl4-openssl-dev libcurl4-gnutls-dev
Package alternative matched for libcurl4-openssl-dev
Considering a package alternative: libopenscenegraph-3.4-dev libopenscenegraph-dev libopenscenegraph-[0-9]+\.[0-9]+-dev
Package alternative matched for libopenscenegraph-dev
Considering a package alternative: libpng-dev libpng12-dev libpng16-dev
Package alternative matched for libpng12-dev
Considering an optional package alternative: qml-module-qtquick2
Optional package alternative matched for qml-module-qtquick2
Considering an optional package alternative: qml-module-qtquick-window2
Optional package alternative matched for qml-module-qtquick-window2
Considering an optional package alternative: qml-module-qtquick-dialogs
Optional package alternative matched for qml-module-qtquick-dialogs
Considering an optional package alternative: qtbase5-private-dev
Optional package alternative matched for qtbase5-private-dev
Considering an optional package alternative: qtdeclarative5-private-dev
Optional package alternative matched for qtdeclarative5-private-dev
DIRECTORY= /home/chris/fg2019_2
***********************************
****************************************
************** FLIGHTGEAR **************
****************************************
CMAKE Build type: RelWithDebInfo
-- Setting build type to 'Dev' as none was specified.
-- The C compiler identification is GNU 5.4.0
-- The CXX compiler identification is GNU 5.4.0
-- Check for working C compiler: /usr/bin/cc
-- Check for working C compiler: /usr/bin/cc -- works
-- Detecting C compiler ABI info
-- Detecting C compiler ABI info - done
-- Detecting C compile features
-- Detecting C compile features - done
-- Check for working CXX compiler: /usr/bin/c++
-- Check for working CXX compiler: /usr/bin/c++ -- works
-- Detecting CXX compiler ABI info
-- Detecting CXX compiler ABI info - done
-- Detecting CXX compile features
-- Detecting CXX compile features - done
-- System is: Linux
-- Linux distro is: LinuxMint
-- Web browser launcher command is: xdg-open
-- Using default data directory for base package:  /home/chris/fg2019_2/install/flightgear/lib/FlightGear
-- Looking for pthread.h
-- Looking for pthread.h - found
-- Performing Test CMAKE_HAVE_LIBC_PTHREAD
-- Performing Test CMAKE_HAVE_LIBC_PTHREAD - Failed
-- Looking for pthread_create in pthreads
-- Looking for pthread_create in pthreads - not found
-- Looking for pthread_create in pthread
-- Looking for pthread_create in pthread - found
-- Found Threads: TRUE  
-- Found X11: /usr/include   
-- Looking for XOpenDisplay in /usr/lib/x86_64-linux-gnu/libX11.so;/usr/lib/x86_64-linux-gnu/libXext.so
-- Looking for XOpenDisplay in /usr/lib/x86_64-linux-gnu/libX11.so;/usr/lib/x86_64-linux-gnu/libXext.so - found
-- Looking for gethostbyname
-- Looking for gethostbyname - found
-- Looking for connect
-- Looking for connect - found
-- Looking for remove
-- Looking for remove - found
-- Looking for shmat
-- Looking for shmat - found
-- Looking for IceConnectionNumber in ICE
-- Looking for IceConnectionNumber in ICE - found
-- libudev stable: 1
-- Found UDev: /usr/lib/x86_64-linux-gnu/libudev.so
--    include: /usr/include
-- event-based input enabled. Using /usr/lib/x86_64-linux-gnu/libudev.so
-- Boost version: 1.58.0
-- Found OpenGL: /usr/lib/x86_64-linux-gnu/libGL.so   
-- Found osgText: /home/chris/fg2019_2/install/openscenegraph/lib/libosgText.so  
-- Found osgSim: /home/chris/fg2019_2/install/openscenegraph/lib/libosgSim.so  
-- Found osgDB: /home/chris/fg2019_2/install/openscenegraph/lib/libosgDB.so  
-- Found osgParticle: /home/chris/fg2019_2/install/openscenegraph/lib/libosgParticle.so  
-- Found osgFX: /home/chris/fg2019_2/install/openscenegraph/lib/libosgFX.so  
-- Found osgUtil: /home/chris/fg2019_2/install/openscenegraph/lib/libosgUtil.so  
-- Found osgViewer: /home/chris/fg2019_2/install/openscenegraph/lib/libosgViewer.so  
-- Found osgGA: /home/chris/fg2019_2/install/openscenegraph/lib/libosgGA.so  
-- Found osg: /home/chris/fg2019_2/install/openscenegraph/lib/libosg.so  
-- Found OpenThreads: /home/chris/fg2019_2/install/openscenegraph/lib/libOpenThreads.so  
-- Found OpenSceneGraph: /home/chris/fg2019_2/install/openscenegraph/lib/libosgText.so;/home/chris/fg2019_2/install/openscenegraph/lib/libosgSim.so;/home/chris/fg2019_2/install/openscenegraph/lib/libosgDB.so;/home/chris/fg2019_2/install/openscenegraph/lib/libosgParticle.so;/home/chris/fg2019_2/install/openscenegraph/lib/libosgFX.so;/home/chris/fg2019_2/install/openscenegraph/lib/libosgUtil.so;/home/chris/fg2019_2/install/openscenegraph/lib/libosgViewer.so;/home/chris/fg2019_2/install/openscenegraph/lib/libosgGA.so;/home/chris/fg2019_2/install/openscenegraph/lib/libosg.so;/home/chris/fg2019_2/install/openscenegraph/lib/libOpenThreads.so (found suitable version "3.4.2", minimum required is "3.2.0") 
-- Found PkgConfig: /usr/bin/pkg-config (found version "0.29.1") 
-- Checking for module 'dbus-1'
--   Found dbus-1, version 1.10.6
-- Using DBus
-- Qt launcher enabled, checking for Qt >= 5.4 / qmake
-- Will enable Qt launcher GUI
--   Qt5Widgets version: 5.5.1
--   Qt5Widgets include dir: /usr/include/x86_64-linux-gnu/qt5/;/usr/include/x86_64-linux-gnu/qt5/QtWidgets;/usr/include/x86_64-linux-gnu/qt5/QtGui;/usr/include/x86_64-linux-gnu/qt5/QtCore;/usr/lib/x86_64-linux-gnu/qt5//mkspecs/linux-g++-64;/usr/include
-- Couldn't find translations data, will not include translated string in the executable
-- Could NOT find Qt5LinguistTools (missing: Qt5LinguistTools_DIR)
CMake Warning at CMakeModules/Translations.cmake:18 (find_package):
  Found package configuration file:

    /usr/lib/x86_64-linux-gnu/cmake/Qt5/Qt5Config.cmake

  but it set Qt5_FOUND to FALSE so package "Qt5" is considered to be NOT
  FOUND.  Reason given by package:

  Failed to find Qt5 component "LinguistTools" config file at
  "/usr/lib/x86_64-linux-gnu/cmake/Qt5LinguistTools/Qt5LinguistToolsConfig.cmake"


  

Call Stack (most recent call first):
  CMakeLists.txt:333 (include)


-- /home/chris/fg2019_2/install/plib/include
-- Found PLIB: optimized;/home/chris/fg2019_2/install/plib/lib/libplibpuaux.a;debug;/home/chris/fg2019_2/install/plib/lib/libplibpuaux.a;optimized;/home/chris/fg2019_2/install/plib/lib/libplibpu.a;debug;/home/chris/fg2019_2/install/plib/lib/libplibpu.a;optimized;/home/chris/fg2019_2/install/plib/lib/libplibfnt.a;debug;/home/chris/fg2019_2/install/plib/lib/libplibfnt.a;optimized;/home/chris/fg2019_2/install/plib/lib/libplibsg.a;debug;/home/chris/fg2019_2/install/plib/lib/libplibsg.a;optimized;/home/chris/fg2019_2/install/plib/lib/libplibul.a;debug;/home/chris/fg2019_2/install/plib/lib/libplibul.a  
-- Min Simgear version is 2019.2.0
-- Found ZLIB: /usr/lib/x86_64-linux-gnu/libz.so (found version "1.2.8") 
-- Looking for unistd.h
-- Looking for unistd.h - found
-- Looking for sys/time.h
-- Looking for sys/time.h - found
-- Looking for sys/timeb.h
-- Looking for sys/timeb.h - found
-- Looking for windows.h
-- Looking for windows.h - not found
-- Looking for timegm
-- Looking for timegm - found
-- Looking for daylight
-- Looking for daylight - found
-- Looking for ftime
-- Looking for ftime - found
-- Looking for gettimeofday
-- Looking for gettimeofday - found
-- RTI: DISABLED
-- OpenMP: DISABLED
-- SSE/SSE2 support: ENABLED
-- Looking for mkfifo
-- Looking for mkfifo - found
-- Enabling legacy joystick code (from PLIB)
-- Found PNG: /usr/lib/x86_64-linux-gnu/libpng.so (found version "1.2.54") 
-- Found GLEW: /usr/include (found version "1.13.0") 
-- Found Freetype: /usr/lib/x86_64-linux-gnu/libfreetype.so  
-- Found GLUT: /usr/lib/x86_64-linux-gnu/libglut.a  
-- found GLUT inc /usr/include, lib /usr/lib/x86_64-linux-gnu/libglut.a;/usr/lib/x86_64-linux-gnu/libXmu.a;/usr/lib/x86_64-linux-gnu/libXi.a 
-- Found OpenAL: /usr/lib/x86_64-linux-gnu/libopenal.so  
-- CppUnit: Building the FlightGear supplied CppUnit library
-- Configuring done
-- Generating done
-- Build files have been written to: /home/chris/fg2019_2/build/flightgear
MAKE flightgear
Scanning dependencies of target PLIBJoystick
Scanning dependencies of target fgtraffic
Scanning dependencies of target hts_engine
[  0%] Building CXX object 3rdparty/joystick/CMakeFiles/PLIBJoystick.dir/js.cxx.o
Scanning dependencies of target fgelev
[  0%] Building CXX object utils/traffic/CMakeFiles/fgtraffic.dir/fgtraffic.cxx.o
[  0%] Building C object 3rdparty/hts_engine_API/CMakeFiles/hts_engine.dir/lib/HTS_audio.c.o
Scanning dependencies of target GPSsmooth
[  0%] Building CXX object utils/fgelev/CMakeFiles/fgelev.dir/fgelev.cxx.o
Scanning dependencies of target MIDGsmooth
Scanning dependencies of target UGsmooth
[  1%] Building CXX object utils/GPSsmooth/CMakeFiles/MIDGsmooth.dir/MIDG-II.cxx.o
[  1%] Building CXX object utils/GPSsmooth/CMakeFiles/GPSsmooth.dir/GPSsmooth.cxx.o
[  1%] Building CXX object utils/GPSsmooth/CMakeFiles/UGsmooth.dir/UGear.cxx.o
Scanning dependencies of target iaxclient_lib
[  1%] Building C object 3rdparty/iaxclient/lib/CMakeFiles/iaxclient_lib.dir/audio_encode.c.o
[  1%] Building C object 3rdparty/hts_engine_API/CMakeFiles/hts_engine.dir/lib/HTS_engine.c.o
Scanning dependencies of target fgsqlite3
Scanning dependencies of target fgpanel
[  1%] Building C object 3rdparty/sqlite3/CMakeFiles/fgsqlite3.dir/sqlite3.c.o
Scanning dependencies of target flite_hts
[  1%] Building CXX object utils/fgpanel/CMakeFiles/fgpanel.dir/main.cxx.o
[  1%] Building C object 3rdparty/flite_hts_engine/CMakeFiles/flite_hts.dir/flite/src/hrg/cst_ffeature.c.o
Scanning dependencies of target fgviewer
[  1%] Building CXX object utils/fgviewer/CMakeFiles/fgviewer.dir/fgviewer.cxx.o
[  1%] Building C object 3rdparty/flite_hts_engine/CMakeFiles/flite_hts.dir/flite/src/hrg/cst_item.c.o
[  1%] Building C object 3rdparty/iaxclient/lib/CMakeFiles/iaxclient_lib.dir/audio_file.c.o
[  1%] Linking CXX executable fgtraffic
[  1%] Building C object 3rdparty/iaxclient/lib/CMakeFiles/iaxclient_lib.dir/audio_openal.c.o
[  1%] Building C object 3rdparty/flite_hts_engine/CMakeFiles/flite_hts.dir/flite/src/hrg/cst_relation.c.o
[  1%] Building C object 3rdparty/hts_engine_API/CMakeFiles/hts_engine.dir/lib/HTS_gstream.c.o
[  1%] Built target fgtraffic
[  1%] Building C object 3rdparty/flite_hts_engine/CMakeFiles/flite_hts.dir/flite/src/hrg/cst_utterance.c.o
Scanning dependencies of target fgrcc
[  1%] Building CXX object src/EmbeddedResources/CMakeFiles/fgrcc.dir/fgrcc.cxx.o
[  3%] Building C object 3rdparty/iaxclient/lib/CMakeFiles/iaxclient_lib.dir/codec_alaw.c.o
[  3%] Building C object 3rdparty/hts_engine_API/CMakeFiles/hts_engine.dir/lib/HTS_label.c.o
[  3%] Building C object 3rdparty/flite_hts_engine/CMakeFiles/flite_hts.dir/flite/src/lexicon/cst_lexicon.c.o
[  3%] Building CXX object 3rdparty/joystick/CMakeFiles/PLIBJoystick.dir/jsLinux.cxx.o
/home/chris/fg2019_2/flightgear/3rdparty/flite_hts_engine/flite/src/lexicon/cst_lexicon.c:93:12: warning: ‘no_syl_boundaries’ declared ‘static’ but never defined [-Wunused-function]
 static int no_syl_boundaries(const cst_item *i, const cst_val *p);
            ^
[  3%] Building C object 3rdparty/iaxclient/lib/CMakeFiles/iaxclient_lib.dir/codec_gsm.c.o
[  3%] Building C object 3rdparty/hts_engine_API/CMakeFiles/hts_engine.dir/lib/HTS_misc.c.o
[  3%] Building C object 3rdparty/flite_hts_engine/CMakeFiles/flite_hts.dir/flite/src/lexicon/cst_lts.c.o
[  3%] Building C object 3rdparty/iaxclient/lib/CMakeFiles/iaxclient_lib.dir/codec_ulaw.c.o
[  3%] Building CXX object utils/GPSsmooth/CMakeFiles/GPSsmooth.dir/gps_main.cxx.o
[  3%] Building C object 3rdparty/flite_hts_engine/CMakeFiles/flite_hts.dir/flite/src/regex/cst_regex.c.o
[  3%] Building C object 3rdparty/iaxclient/lib/CMakeFiles/iaxclient_lib.dir/iaxclient_lib.c.o
[  3%] Building C object 3rdparty/hts_engine_API/CMakeFiles/hts_engine.dir/lib/HTS_model.c.o
[  3%] Building C object 3rdparty/flite_hts_engine/CMakeFiles/flite_hts.dir/flite/src/regex/regexp.c.o
[  3%] Building CXX object utils/fgpanel/CMakeFiles/fgpanel.dir/ApplicationProperties.cxx.o
[  3%] Linking CXX static library libPLIBJoystick.a
[  3%] Built target PLIBJoystick
Scanning dependencies of target fgqmlui_autogen
[  3%] Automatic MOC for target fgqmlui
[  3%] Building C object 3rdparty/flite_hts_engine/CMakeFiles/flite_hts.dir/flite/src/stats/cst_cart.c.o
[  3%] Building CXX object utils/GPSsmooth/CMakeFiles/MIDGsmooth.dir/MIDG_main.cxx.o
[  3%] Building C object 3rdparty/flite_hts_engine/CMakeFiles/flite_hts.dir/flite/src/synth/cst_ffeatures.c.o
[  3%] Building C object 3rdparty/iaxclient/lib/CMakeFiles/iaxclient_lib.dir/unixfuncs.c.o
[  3%] Building C object 3rdparty/iaxclient/lib/CMakeFiles/iaxclient_lib.dir/codec_speex.c.o
[  3%] Building C object 3rdparty/flite_hts_engine/CMakeFiles/flite_hts.dir/flite/src/synth/cst_phoneset.c.o
[  3%] Building CXX object utils/fgpanel/CMakeFiles/fgpanel.dir/FGCroppedTexture.cxx.o
[  3%] Building C object 3rdparty/flite_hts_engine/CMakeFiles/flite_hts.dir/flite/src/synth/cst_synth.c.o
[  3%] Building C object 3rdparty/iaxclient/lib/CMakeFiles/iaxclient_lib.dir/spandsp/plc.c.o
[  3%] Building CXX object utils/GPSsmooth/CMakeFiles/UGsmooth.dir/UGear_command.cxx.o
/home/chris/fg2019_2/flightgear/3rdparty/flite_hts_engine/flite/src/synth/cst_synth.c:108:23: warning: ‘tokentosegs’ declared ‘static’ but never defined [-Wunused-function]
 static cst_utterance *tokentosegs(cst_utterance *u);
                       ^
[  3%] Building C object 3rdparty/iaxclient/lib/CMakeFiles/iaxclient_lib.dir/gsm/src/add.c.o
[  3%] Building C object 3rdparty/hts_engine_API/CMakeFiles/hts_engine.dir/lib/HTS_pstream.c.o
[  3%] Building C object 3rdparty/flite_hts_engine/CMakeFiles/flite_hts.dir/flite/src/synth/cst_utt_utils.c.o
[  3%] Building C object 3rdparty/iaxclient/lib/CMakeFiles/iaxclient_lib.dir/gsm/src/code.c.o
[  3%] Building C object 3rdparty/flite_hts_engine/CMakeFiles/flite_hts.dir/flite/src/synth/cst_voice.c.o
[  3%] Building C object 3rdparty/iaxclient/lib/CMakeFiles/iaxclient_lib.dir/gsm/src/debug.c.o
[  5%] Building C object 3rdparty/flite_hts_engine/CMakeFiles/flite_hts.dir/flite/src/synth/flite.c.o
[  5%] Building C object 3rdparty/iaxclient/lib/CMakeFiles/iaxclient_lib.dir/gsm/src/decode.c.o
[  5%] Building C object 3rdparty/iaxclient/lib/CMakeFiles/iaxclient_lib.dir/gsm/src/gsm_create.c.o
[  5%] Building C object 3rdparty/flite_hts_engine/CMakeFiles/flite_hts.dir/flite/src/utils/cst_alloc.c.o
[  5%] Building C object 3rdparty/iaxclient/lib/CMakeFiles/iaxclient_lib.dir/gsm/src/gsm_decode.c.o
[  5%] Building C object 3rdparty/flite_hts_engine/CMakeFiles/flite_hts.dir/flite/src/utils/cst_error.c.o
[  5%] Building C object 3rdparty/flite_hts_engine/CMakeFiles/flite_hts.dir/flite/src/utils/cst_features.c.o
[  5%] Building C object 3rdparty/hts_engine_API/CMakeFiles/hts_engine.dir/lib/HTS_sstream.c.o
[  5%] Linking CXX executable GPSsmooth
[  5%] Building C object 3rdparty/iaxclient/lib/CMakeFiles/iaxclient_lib.dir/gsm/src/gsm_destroy.c.o
[  5%] Building C object 3rdparty/iaxclient/lib/CMakeFiles/iaxclient_lib.dir/gsm/src/gsm_encode.c.o
[  5%] Building C object 3rdparty/flite_hts_engine/CMakeFiles/flite_hts.dir/flite/src/utils/cst_string.c.o
[  5%] Building CXX object utils/GPSsmooth/CMakeFiles/UGsmooth.dir/UGear_telnet.cxx.o
[  5%] Built target GPSsmooth
Scanning dependencies of target fglauncher_autogen
[  5%] Generating ui_SetupRootDialog.h
[  6%] Building C object 3rdparty/iaxclient/lib/CMakeFiles/iaxclient_lib.dir/gsm/src/gsm_explode.c.o
[  6%] Building C object 3rdparty/flite_hts_engine/CMakeFiles/flite_hts.dir/flite/src/utils/cst_tokenstream.c.o
[  6%] Generating qrc_resources.cpp
/home/chris/fg2019_2/flightgear/3rdparty/flite_hts_engine/flite/src/utils/cst_tokenstream.c: In function ‘ts_get_quoted_token’:
/home/chris/fg2019_2/flightgear/3rdparty/flite_hts_engine/flite/src/utils/cst_tokenstream.c:386:9: warning: variable ‘l’ set but not used [-Wunused-but-set-variable]
     int l, p;
         ^
[  6%] Generating ui_InstallSceneryDialog.h
[  6%] Building C object 3rdparty/hts_engine_API/CMakeFiles/hts_engine.dir/lib/HTS_vocoder.c.o
[  8%] Automatic MOC for target fglauncher
[  8%] Building C object 3rdparty/iaxclient/lib/CMakeFiles/iaxclient_lib.dir/gsm/src/gsm_implode.c.o
/home/chris/fg2019_2/flightgear/3rdparty/flite_hts_engine/flite/src/utils/cst_tokenstream.c: In function ‘ts_set_stream_pos’:
/home/chris/fg2019_2/flightgear/3rdparty/flite_hts_engine/flite/src/utils/cst_tokenstream.c:349:12: warning: ‘new_pos’ may be used uninitialized in this function [-Wmaybe-uninitialized]
     return ts->file_pos;
            ^
[  8%] Building C object 3rdparty/flite_hts_engine/CMakeFiles/flite_hts.dir/flite/src/utils/cst_val.c.o
[  8%] Building C object 3rdparty/iaxclient/lib/CMakeFiles/iaxclient_lib.dir/gsm/src/gsm_option.c.o
/home/chris/fg2019_2/flightgear/3rdparty/flite_hts_engine/flite/src/utils/cst_val.c: In function ‘cst_utf8_explode’:
/home/chris/fg2019_2/flightgear/3rdparty/flite_hts_engine/flite/src/utils/cst_val.c:520:12: warning: variable ‘l’ set but not used [-Wunused-but-set-variable]
     int i, l=0;
            ^
[  8%] Building C object 3rdparty/iaxclient/lib/CMakeFiles/iaxclient_lib.dir/gsm/src/gsm_print.c.o
[  8%] Building C object 3rdparty/iaxclient/lib/CMakeFiles/iaxclient_lib.dir/gsm/src/long_term.c.o
[  8%] Linking CXX executable MIDGsmooth
[  8%] Building C object 3rdparty/flite_hts_engine/CMakeFiles/flite_hts.dir/flite/src/utils/cst_val_const.c.o
[  8%] Building CXX object utils/fgpanel/CMakeFiles/fgpanel.dir/FGDummyTextureLoader.cxx.o
[  8%] Building C object 3rdparty/flite_hts_engine/CMakeFiles/flite_hts.dir/flite/src/utils/cst_val_user.c.o
[  8%] Building C object 3rdparty/iaxclient/lib/CMakeFiles/iaxclient_lib.dir/gsm/src/lpc.c.o
[  8%] Linking C static library libhts_engine.a
[  8%] Building C object 3rdparty/flite_hts_engine/CMakeFiles/flite_hts.dir/flite/lang/cmu_us_kal/cmu_us_kal.c.o
[  8%] Built target hts_engine
[  8%] Built target MIDGsmooth
Scanning dependencies of target fgjs
Scanning dependencies of target js_demo
[  8%] Building CXX object src/Input/CMakeFiles/fgjs.dir/fgjs.cxx.o
[  8%] Building CXX object src/Input/CMakeFiles/js_demo.dir/js_demo.cxx.o
[  8%] Building C object 3rdparty/flite_hts_engine/CMakeFiles/flite_hts.dir/flite/lang/cmulex/cmu_lex.c.o
/home/chris/fg2019_2/flightgear/3rdparty/flite_hts_engine/flite/lang/cmulex/cmu_lex.c: In function ‘cmu_lex_init’:
/home/chris/fg2019_2/flightgear/3rdparty/flite_hts_engine/flite/lang/cmulex/cmu_lex.c:359:18: warning: assignment discards ‘const’ qualifier from pointer target type [-Wdiscarded-qualifiers]
     cmu_lex.data = cmu_lex_data;
                  ^
[  8%] Building CXX object utils/GPSsmooth/CMakeFiles/UGsmooth.dir/UGear_main.cxx.o
[  8%] Building C object 3rdparty/iaxclient/lib/CMakeFiles/iaxclient_lib.dir/gsm/src/preprocess.c.o
[  8%] Building C object 3rdparty/flite_hts_engine/CMakeFiles/flite_hts.dir/flite/lang/cmulex/cmu_lex_data.c.o
[  8%] Building CXX object utils/fgpanel/CMakeFiles/fgpanel.dir/FGFontCache.cxx.o
[  8%] Building C object 3rdparty/iaxclient/lib/CMakeFiles/iaxclient_lib.dir/gsm/src/rpe.c.o
[  8%] Building C object 3rdparty/iaxclient/lib/CMakeFiles/iaxclient_lib.dir/gsm/src/short_term.c.o
[  8%] Linking CXX executable js_demo
[  8%] Built target js_demo
[  8%] Building C object 3rdparty/iaxclient/lib/CMakeFiles/iaxclient_lib.dir/gsm/src/table.c.o
[  8%] Building C object 3rdparty/iaxclient/lib/CMakeFiles/iaxclient_lib.dir/libspeex/bits.c.o
Scanning dependencies of target yasim-proptest
[  8%] Building CXX object src/FDM/YASim/CMakeFiles/yasim-proptest.dir/proptest.cpp.o
[  8%] Building C object 3rdparty/iaxclient/lib/CMakeFiles/iaxclient_lib.dir/libspeex/cb_search.c.o
[  8%] Building C object 3rdparty/iaxclient/lib/CMakeFiles/iaxclient_lib.dir/libspeex/exc_10_16_table.c.o
[  8%] Building C object 3rdparty/flite_hts_engine/CMakeFiles/flite_hts.dir/flite/lang/cmulex/cmu_lex_entries.c.o
[  8%] Building C object 3rdparty/iaxclient/lib/CMakeFiles/iaxclient_lib.dir/libspeex/exc_10_32_table.c.o
[  8%] Building C object 3rdparty/iaxclient/lib/CMakeFiles/iaxclient_lib.dir/libspeex/exc_20_32_table.c.o
[  8%] Built target fgqmlui_autogen
[  8%] Building C object 3rdparty/flite_hts_engine/CMakeFiles/flite_hts.dir/flite/lang/cmulex/cmu_lts_model.c.o
[ 10%] Building C object 3rdparty/iaxclient/lib/CMakeFiles/iaxclient_lib.dir/libspeex/exc_5_256_table.c.o
[ 10%] Linking CXX executable fgrcc
[ 10%] Building C object 3rdparty/iaxclient/lib/CMakeFiles/iaxclient_lib.dir/libspeex/exc_5_64_table.c.o
[ 10%] Building C object 3rdparty/iaxclient/lib/CMakeFiles/iaxclient_lib.dir/libspeex/exc_8_128_table.c.o
Scanning dependencies of target yasim
[ 10%] Building CXX object src/FDM/YASim/CMakeFiles/yasim.dir/yasim-test.cpp.o
[ 10%] Building C object 3rdparty/iaxclient/lib/CMakeFiles/iaxclient_lib.dir/libspeex/filters.c.o
[ 10%] Built target fgrcc
[ 10%] Building CXX object src/Input/CMakeFiles/fgjs.dir/jsinput.cxx.o
[ 10%] Building C object 3rdparty/iaxclient/lib/CMakeFiles/iaxclient_lib.dir/libspeex/gain_table.c.o
[ 10%] Building CXX object utils/fgpanel/CMakeFiles/fgpanel.dir/FGGLApplication.cxx.o
[ 10%] Building C object 3rdparty/iaxclient/lib/CMakeFiles/iaxclient_lib.dir/libspeex/gain_table_lbr.c.o
[ 10%] Building C object 3rdparty/iaxclient/lib/CMakeFiles/iaxclient_lib.dir/libspeex/hexc_10_32_table.c.o
[ 10%] Building C object 3rdparty/iaxclient/lib/CMakeFiles/iaxclient_lib.dir/libspeex/hexc_table.c.o
[ 10%] Building C object 3rdparty/iaxclient/lib/CMakeFiles/iaxclient_lib.dir/libspeex/high_lsp_tables.c.o
[ 11%] Building C object 3rdparty/flite_hts_engine/CMakeFiles/flite_hts.dir/flite/lang/cmulex/cmu_lts_rules.c.o
In file included from /home/chris/fg2019_2/flightgear/src/FDM/YASim/proptest.cpp:8:0:
/home/chris/fg2019_2/flightgear/src/FDM/YASim/yasim-common.hpp:41:24: warning: ‘yasim::DEF_PROP_ELEVATOR_TRIM’ defined but not used [-Wunused-variable]
     static const char* DEF_PROP_ELEVATOR_TRIM = "/controls/flight/elevator-trim";
                        ^
[ 11%] Building C object 3rdparty/iaxclient/lib/CMakeFiles/iaxclient_lib.dir/libspeex/jitter.c.o
[ 11%] Building C object 3rdparty/flite_hts_engine/CMakeFiles/flite_hts.dir/flite/lang/cmulex/cmu_postlex.c.o
[ 11%] Building CXX object src/FDM/YASim/CMakeFiles/yasim-proptest.dir/Airplane.cpp.o
[ 11%] Building C object 3rdparty/iaxclient/lib/CMakeFiles/iaxclient_lib.dir/libspeex/lbr_48k_tables.c.o
[ 11%] Building C object 3rdparty/iaxclient/lib/CMakeFiles/iaxclient_lib.dir/libspeex/lpc.c.o
[ 11%] Building C object 3rdparty/flite_hts_engine/CMakeFiles/flite_hts.dir/flite/lang/usenglish/us_aswd.c.o
Scanning dependencies of target JSBSim
[ 11%] Building C object 3rdparty/iaxclient/lib/CMakeFiles/iaxclient_lib.dir/libspeex/lsp.c.o
[ 11%] Building CXX object src/FDM/JSBSim/CMakeFiles/JSBSim.dir/FGFDMExec.cpp.o
[ 11%] Building C object 3rdparty/flite_hts_engine/CMakeFiles/flite_hts.dir/flite/lang/usenglish/us_expand.c.o
[ 11%] Building CXX object src/Input/CMakeFiles/fgjs.dir/jssuper.cxx.o
[ 11%] Linking CXX executable fgelev
[ 11%] Building C object 3rdparty/iaxclient/lib/CMakeFiles/iaxclient_lib.dir/libspeex/lsp_tables_nb.c.o
[ 13%] Building C object 3rdparty/iaxclient/lib/CMakeFiles/iaxclient_lib.dir/libspeex/ltp.c.o
[ 13%] Building C object 3rdparty/flite_hts_engine/CMakeFiles/flite_hts.dir/flite/lang/usenglish/us_ffeatures.c.o
[ 13%] Building CXX object utils/fgpanel/CMakeFiles/fgpanel.dir/FGGroupLayer.cxx.o
[ 13%] Linking CXX executable UGsmooth
[ 13%] Linking CXX executable fgjs
[ 13%] Building C object 3rdparty/iaxclient/lib/CMakeFiles/iaxclient_lib.dir/libspeex/math_approx.c.o
[ 13%] Building C object 3rdparty/iaxclient/lib/CMakeFiles/iaxclient_lib.dir/libspeex/mdf.c.o
[ 13%] Built target UGsmooth
Scanning dependencies of target metar
[ 13%] Building CXX object src/Main/CMakeFiles/metar.dir/metar_main.cxx.o
[ 13%] Building C object 3rdparty/flite_hts_engine/CMakeFiles/flite_hts.dir/flite/lang/usenglish/us_gpos.c.o
[ 13%] Building C object 3rdparty/flite_hts_engine/CMakeFiles/flite_hts.dir/flite/lang/usenglish/us_int_accent_cart.c.o
[ 13%] Built target fgjs
Scanning dependencies of target buildId
[ 13%] Building C object 3rdparty/flite_hts_engine/CMakeFiles/flite_hts.dir/flite/lang/usenglish/us_int_tone_cart.c.o
-- Found Git: /usr/bin/git (found version "2.7.4") 
-- Git revision is a9761bb3bac9e9fed7e7577498f287a4532f65bb
[ 13%] Built target buildId
[ 13%] Building C object 3rdparty/flite_hts_engine/CMakeFiles/flite_hts.dir/flite/lang/usenglish/us_nums_cart.c.o
[ 13%] Building C object 3rdparty/flite_hts_engine/CMakeFiles/flite_hts.dir/flite/lang/usenglish/us_phoneset.c.o
[ 13%] Building CXX object src/FDM/YASim/CMakeFiles/yasim.dir/Airplane.cpp.o
[ 13%] Building C object 3rdparty/flite_hts_engine/CMakeFiles/flite_hts.dir/flite/lang/usenglish/us_phrasing_cart.c.o
[ 13%] Building CXX object utils/fgpanel/CMakeFiles/fgpanel.dir/FGInstrumentLayer.cxx.o
[ 13%] Building C object 3rdparty/iaxclient/lib/CMakeFiles/iaxclient_lib.dir/libspeex/medfilter.c.o
[ 13%] Building C object 3rdparty/flite_hts_engine/CMakeFiles/flite_hts.dir/flite/lang/usenglish/us_pos_cart.c.o
[ 13%] Building C object 3rdparty/iaxclient/lib/CMakeFiles/iaxclient_lib.dir/libspeex/misc.c.o
[ 13%] Building C object 3rdparty/flite_hts_engine/CMakeFiles/flite_hts.dir/flite/lang/usenglish/us_text.c.o
Scanning dependencies of target fgqmlui
[ 13%] Building C object 3rdparty/iaxclient/lib/CMakeFiles/iaxclient_lib.dir/libspeex/modes.c.o
[ 13%] Building CXX object src/GUI/CMakeFiles/fgqmlui.dir/fgqmlui_autogen/mocs_compilation.cpp.o
[ 13%] Building C object 3rdparty/iaxclient/lib/CMakeFiles/iaxclient_lib.dir/libspeex/nb_celp.c.o
[ 13%] Built target fglauncher_autogen
[ 13%] Building C object 3rdparty/flite_hts_engine/CMakeFiles/flite_hts.dir/flite/lang/usenglish/usenglish.c.o
[ 13%] Building C object 3rdparty/flite_hts_engine/CMakeFiles/flite_hts.dir/lib/flite_hts_engine.c.o
[ 13%] Building CXX object utils/fgpanel/CMakeFiles/fgpanel.dir/FGLayeredInstrument.cxx.o
[ 15%] Linking C static library libflite_hts.a
[ 15%] Building CXX object utils/fgviewer/CMakeFiles/fgviewer.dir/Drawable.cxx.o
[ 15%] Building C object 3rdparty/iaxclient/lib/CMakeFiles/iaxclient_lib.dir/libspeex/preprocess.c.o
[ 15%] Built target flite_hts
[ 15%] Building C object 3rdparty/iaxclient/lib/CMakeFiles/iaxclient_lib.dir/libspeex/quant_lsp.c.o
[ 15%] Built target fgelev
[ 15%] Building C object 3rdparty/iaxclient/lib/CMakeFiles/iaxclient_lib.dir/libspeex/sb_celp.c.o
Scanning dependencies of target fglauncher
[ 15%] Building CXX object src/GUI/CMakeFiles/fglauncher.dir/fglauncher_autogen/mocs_compilation.cpp.o
[ 15%] Building C object 3rdparty/iaxclient/lib/CMakeFiles/iaxclient_lib.dir/libspeex/smallft.c.o
[ 15%] Building CXX object src/FDM/YASim/CMakeFiles/yasim-proptest.dir/Atmosphere.cpp.o
[ 15%] Building C object 3rdparty/iaxclient/lib/CMakeFiles/iaxclient_lib.dir/libspeex/speex.c.o
[ 15%] Building CXX object src/FDM/YASim/CMakeFiles/yasim-proptest.dir/ControlMap.cpp.o
[ 15%] Building C object 3rdparty/iaxclient/lib/CMakeFiles/iaxclient_lib.dir/libspeex/speex_callbacks.c.o
[ 15%] Building CXX object utils/fgviewer/CMakeFiles/fgviewer.dir/Renderer.cxx.o
[ 15%] Building CXX object utils/fgviewer/CMakeFiles/fgviewer.dir/SlaveCamera.cxx.o
[ 15%] Building CXX object utils/fgpanel/CMakeFiles/fgpanel.dir/FGPanel.cxx.o
[ 15%] Building C object 3rdparty/iaxclient/lib/CMakeFiles/iaxclient_lib.dir/libspeex/speex_header.c.o
[ 15%] Building C object 3rdparty/iaxclient/lib/CMakeFiles/iaxclient_lib.dir/libspeex/stereo.c.o
[ 15%] Building CXX object src/FDM/YASim/CMakeFiles/yasim.dir/Atmosphere.cpp.o
[ 16%] Building C object 3rdparty/iaxclient/lib/CMakeFiles/iaxclient_lib.dir/libspeex/vbr.c.o
[ 16%] Building C object 3rdparty/iaxclient/lib/CMakeFiles/iaxclient_lib.dir/libspeex/vq.c.o
[ 16%] Building C object 3rdparty/iaxclient/lib/CMakeFiles/iaxclient_lib.dir/libiax2/src/iax.c.o
[ 16%] Building CXX object src/FDM/YASim/CMakeFiles/yasim.dir/ControlMap.cpp.o
/home/chris/fg2019_2/flightgear/3rdparty/iaxclient/lib/libiax2/src/iax.c: In function ‘iax_transfer’:
/home/chris/fg2019_2/flightgear/3rdparty/iaxclient/lib/libiax2/src/iax.c:1354:13: warning: variable ‘res’ set but not used [-Wunused-but-set-variable]
  static int res;    //Return Code
             ^
[ 16%] Linking CXX executable metar
[ 16%] Built target metar
[ 16%] Building CXX object src/FDM/YASim/CMakeFiles/yasim.dir/FGFDM.cpp.o
[ 18%] Building CXX object utils/fgpanel/CMakeFiles/fgpanel.dir/FGPanelApplication.cxx.o
In file included from /home/chris/fg2019_2/flightgear/src/FDM/YASim/Wing.hpp:4:0,
                 from /home/chris/fg2019_2/flightgear/src/FDM/YASim/ControlMap.cpp:15:
/home/chris/fg2019_2/flightgear/src/FDM/YASim/yasim-common.hpp:41:24: warning: ‘yasim::DEF_PROP_ELEVATOR_TRIM’ defined but not used [-Wunused-variable]
     static const char* DEF_PROP_ELEVATOR_TRIM = "/controls/flight/elevator-trim";
                        ^
[ 18%] Building C object 3rdparty/iaxclient/lib/CMakeFiles/iaxclient_lib.dir/libiax2/src/iax2-parser.c.o
[ 18%] Building CXX object src/FDM/YASim/CMakeFiles/yasim-proptest.dir/FGFDM.cpp.o
[ 18%] Building C object 3rdparty/iaxclient/lib/CMakeFiles/iaxclient_lib.dir/libiax2/src/jitterbuf.c.o
[ 18%] Building C object 3rdparty/iaxclient/lib/CMakeFiles/iaxclient_lib.dir/libiax2/src/md5.c.o
In file included from /home/chris/fg2019_2/flightgear/src/FDM/YASim/Wing.hpp:4:0,
                 from /home/chris/fg2019_2/flightgear/src/FDM/YASim/ControlMap.cpp:15:
/home/chris/fg2019_2/flightgear/src/FDM/YASim/yasim-common.hpp:41:24: warning: ‘yasim::DEF_PROP_ELEVATOR_TRIM’ defined but not used [-Wunused-variable]
     static const char* DEF_PROP_ELEVATOR_TRIM = "/controls/flight/elevator-trim";
                        ^
[ 18%] Linking C static library libiaxclient_lib.a
[ 18%] Building CXX object src/FDM/JSBSim/CMakeFiles/JSBSim.dir/FGJSBBase.cpp.o
[ 18%] Built target iaxclient_lib
[ 18%] Building CXX object utils/fgviewer/CMakeFiles/fgviewer.dir/Viewer.cxx.o
[ 18%] Building CXX object src/FDM/YASim/CMakeFiles/yasim.dir/Gear.cpp.o
[ 18%] Building CXX object utils/fgpanel/CMakeFiles/fgpanel.dir/FGPanelInstrument.cxx.o
[ 18%] Building CXX object utils/fgpanel/CMakeFiles/fgpanel.dir/FGPanelProtocol.cxx.o
[ 18%] Building CXX object utils/fgpanel/CMakeFiles/fgpanel.dir/FGPanelTransformation.cxx.o
[ 18%] Building CXX object utils/fgpanel/CMakeFiles/fgpanel.dir/FGPNGTextureLoader.cxx.o
[ 18%] Building CXX object src/FDM/YASim/CMakeFiles/yasim.dir/Glue.cpp.o
[ 18%] Building CXX object src/FDM/JSBSim/CMakeFiles/JSBSim.dir/JSBSim.cxx.o
/home/chris/fg2019_2/flightgear/utils/fgpanel/FGPNGTextureLoader.cxx: In member function ‘virtual GLuint FGPNGTextureLoader::loadTexture(const string&)’:
/home/chris/fg2019_2/flightgear/utils/fgpanel/FGPNGTextureLoader.cxx:56:27: warning: ignoring return value of ‘size_t fread(void*, size_t, size_t, FILE*)’, declared with attribute warn_unused_result [-Wunused-result]
   fread (header, 1, 8, fp);
                           ^
[ 18%] Building CXX object utils/fgpanel/CMakeFiles/fgpanel.dir/FGRGBTextureLoader.cxx.o
[ 18%] Building CXX object utils/fgpanel/CMakeFiles/fgpanel.dir/FGSwitchLayer.cxx.o
In file included from /home/chris/fg2019_2/flightgear/src/FDM/YASim/FGFDM.cpp:11:0:
/home/chris/fg2019_2/flightgear/src/FDM/YASim/yasim-common.hpp:41:24: warning: ‘yasim::DEF_PROP_ELEVATOR_TRIM’ defined but not used [-Wunused-variable]
     static const char* DEF_PROP_ELEVATOR_TRIM = "/controls/flight/elevator-trim";
                        ^
[ 18%] Building CXX object utils/fgpanel/CMakeFiles/fgpanel.dir/FGTextLayer.cxx.o
[ 18%] Building CXX object src/FDM/YASim/CMakeFiles/yasim.dir/Ground.cpp.o
[ 18%] Building CXX object src/FDM/YASim/CMakeFiles/yasim.dir/Hitch.cpp.o
In file included from /home/chris/fg2019_2/flightgear/src/FDM/YASim/FGFDM.cpp:11:0:
/home/chris/fg2019_2/flightgear/src/FDM/YASim/yasim-common.hpp:41:24: warning: ‘yasim::DEF_PROP_ELEVATOR_TRIM’ defined but not used [-Wunused-variable]
     static const char* DEF_PROP_ELEVATOR_TRIM = "/controls/flight/elevator-trim";
                        ^
[ 18%] Building CXX object utils/fgpanel/CMakeFiles/fgpanel.dir/FGTexturedLayer.cxx.o
[ 18%] Building CXX object utils/fgpanel/CMakeFiles/fgpanel.dir/panel_io.cxx.o
[ 18%] Building CXX object src/FDM/YASim/CMakeFiles/yasim-proptest.dir/Gear.cpp.o
[ 18%] Building CXX object src/FDM/YASim/CMakeFiles/yasim.dir/Hook.cpp.o
[ 18%] Building CXX object src/GUI/CMakeFiles/fglauncher.dir/QtLauncher.cxx.o
[ 18%] Building CXX object src/GUI/CMakeFiles/fglauncher.dir/LauncherMainWindow.cxx.o
[ 18%] Building CXX object utils/fgpanel/CMakeFiles/fgpanel.dir/GL_utils.cxx.o
[ 18%] Building CXX object src/FDM/YASim/CMakeFiles/yasim.dir/Integrator.cpp.o
[ 18%] Building CXX object src/FDM/YASim/CMakeFiles/yasim.dir/Jet.cpp.o
[ 20%] Building CXX object src/FDM/YASim/CMakeFiles/yasim.dir/Launchbar.cpp.o
[ 20%] Building CXX object src/FDM/YASim/CMakeFiles/yasim.dir/Model.cpp.o
[ 20%] Building CXX object src/GUI/CMakeFiles/fgqmlui.dir/QQuickDrawable.cxx.o
[ 20%] Building CXX object src/FDM/YASim/CMakeFiles/yasim-proptest.dir/Glue.cpp.o
[ 20%] Building CXX object src/FDM/YASim/CMakeFiles/yasim-proptest.dir/Ground.cpp.o
[ 20%] Building CXX object src/FDM/YASim/CMakeFiles/yasim.dir/PistonEngine.cpp.o
[ 20%] Building CXX object src/FDM/YASim/CMakeFiles/yasim.dir/PropEngine.cpp.o
[ 20%] Building CXX object src/FDM/YASim/CMakeFiles/yasim.dir/Propeller.cpp.o
[ 20%] Building CXX object src/FDM/YASim/CMakeFiles/yasim.dir/RigidBody.cpp.o
[ 20%] Building CXX object src/FDM/YASim/CMakeFiles/yasim.dir/Rotor.cpp.o
[ 20%] Building CXX object src/FDM/YASim/CMakeFiles/yasim-proptest.dir/Hitch.cpp.o
[ 20%] Building CXX object src/FDM/YASim/CMakeFiles/yasim-proptest.dir/Hook.cpp.o
[ 20%] Linking CXX executable fgpanel
/usr/bin/ld: /usr/lib/gcc/x86_64-linux-gnu/5/../../../x86_64-linux-gnu/libGL.so: référence au symbole non défini « XextAddDisplay »
//usr/lib/x86_64-linux-gnu/libXext.so.6: error adding symbols: DSO manquant dans la ligne de commande
collect2: error: ld returned 1 exit status
utils/fgpanel/CMakeFiles/fgpanel.dir/build.make:394 : la recette pour la cible « utils/fgpanel/fgpanel » a échouée
make[2]: *** [utils/fgpanel/fgpanel] Erreur 1
CMakeFiles/Makefile2:688 : la recette pour la cible « utils/fgpanel/CMakeFiles/fgpanel.dir/all » a échouée
make[1]: *** [utils/fgpanel/CMakeFiles/fgpanel.dir/all] Erreur 2
make[1]: *** Attente des tâches non terminées....
[ 20%] Building CXX object src/FDM/YASim/CMakeFiles/yasim-proptest.dir/Integrator.cpp.o
[ 20%] Building CXX object src/FDM/YASim/CMakeFiles/yasim-proptest.dir/Jet.cpp.o
[ 20%] Building CXX object src/FDM/YASim/CMakeFiles/yasim.dir/Rotorpart.cpp.o
In file included from /home/chris/fg2019_2/flightgear/src/FDM/YASim/Version.hpp:4:0,
                 from /home/chris/fg2019_2/flightgear/src/FDM/YASim/Surface.hpp:5,
                 from /home/chris/fg2019_2/flightgear/src/FDM/YASim/Model.cpp:16:
/home/chris/fg2019_2/flightgear/src/FDM/YASim/yasim-common.hpp:41:24: warning: ‘yasim::DEF_PROP_ELEVATOR_TRIM’ defined but not used [-Wunused-variable]
     static const char* DEF_PROP_ELEVATOR_TRIM = "/controls/flight/elevator-trim";
                        ^
[ 20%] Building CXX object src/FDM/YASim/CMakeFiles/yasim.dir/SimpleJet.cpp.o
[ 20%] Building CXX object src/FDM/YASim/CMakeFiles/yasim-proptest.dir/Launchbar.cpp.o
/home/chris/fg2019_2/flightgear/src/GUI/LauncherMainWindow.cxx: In constructor ‘LauncherMainWindow::LauncherMainWindow()’:
/home/chris/fg2019_2/flightgear/src/GUI/LauncherMainWindow.cxx:89:10: warning: unused variable ‘selector’ [-Wunused-variable]
     auto selector = new QQmlFileSelector(engine(), this);
          ^
[ 21%] Building CXX object src/FDM/YASim/CMakeFiles/yasim-proptest.dir/Model.cpp.o
[ 21%] Building CXX object src/FDM/YASim/CMakeFiles/yasim.dir/Surface.cpp.o
[ 21%] Building CXX object src/GUI/CMakeFiles/fglauncher.dir/BaseDiagram.cxx.o
[ 21%] Building CXX object src/FDM/YASim/CMakeFiles/yasim-proptest.dir/PistonEngine.cpp.o
[ 21%] Building CXX object src/FDM/YASim/CMakeFiles/yasim-proptest.dir/PropEngine.cpp.o
[ 21%] Building CXX object src/FDM/YASim/CMakeFiles/yasim-proptest.dir/Propeller.cpp.o
[ 21%] Building CXX object src/FDM/JSBSim/CMakeFiles/JSBSim.dir/initialization/FGInitialCondition.cpp.o
[ 21%] Building CXX object src/FDM/YASim/CMakeFiles/yasim.dir/TurbineEngine.cpp.o
[ 21%] Building CXX object src/FDM/YASim/CMakeFiles/yasim-proptest.dir/RigidBody.cpp.o
[ 21%] Building CXX object src/FDM/YASim/CMakeFiles/yasim.dir/Turbulence.cpp.o
In file included from /home/chris/fg2019_2/flightgear/src/FDM/YASim/Surface.cpp:2:0:
/home/chris/fg2019_2/flightgear/src/FDM/YASim/yasim-common.hpp:41:24: warning: ‘yasim::DEF_PROP_ELEVATOR_TRIM’ defined but not used [-Wunused-variable]
     static const char* DEF_PROP_ELEVATOR_TRIM = "/controls/flight/elevator-trim";
                        ^
[ 21%] Building CXX object src/FDM/YASim/CMakeFiles/yasim-proptest.dir/Rotor.cpp.o
[ 21%] Building CXX object src/FDM/YASim/CMakeFiles/yasim.dir/Wing.cpp.o
[ 21%] Building CXX object src/FDM/YASim/CMakeFiles/yasim.dir/Version.cpp.o
[ 23%] Linking CXX executable fgviewer
In file included from /home/chris/fg2019_2/flightgear/src/FDM/YASim/Version.hpp:4:0,
                 from /home/chris/fg2019_2/flightgear/src/FDM/YASim/Surface.hpp:5,
                 from /home/chris/fg2019_2/flightgear/src/FDM/YASim/Model.cpp:16:
/home/chris/fg2019_2/flightgear/src/FDM/YASim/yasim-common.hpp:41:24: warning: ‘yasim::DEF_PROP_ELEVATOR_TRIM’ defined but not used [-Wunused-variable]
     static const char* DEF_PROP_ELEVATOR_TRIM = "/controls/flight/elevator-trim";
                        ^
[ 23%] Building CXX object src/FDM/YASim/CMakeFiles/yasim-proptest.dir/Rotorpart.cpp.o
[ 25%] Building CXX object src/FDM/YASim/CMakeFiles/yasim.dir/yasim-common.cpp.o
[ 25%] Building CXX object src/FDM/YASim/CMakeFiles/yasim-proptest.dir/SimpleJet.cpp.o
[ 25%] Building CXX object src/FDM/YASim/CMakeFiles/yasim-proptest.dir/Surface.cpp.o
In file included from /home/chris/fg2019_2/flightgear/src/FDM/YASim/yasim-common.cpp:1:0:
/home/chris/fg2019_2/flightgear/src/FDM/YASim/yasim-common.hpp:41:24: warning: ‘yasim::DEF_PROP_ELEVATOR_TRIM’ defined but not used [-Wunused-variable]
     static const char* DEF_PROP_ELEVATOR_TRIM = "/controls/flight/elevator-trim";
                        ^
[ 25%] Building CXX object src/FDM/YASim/CMakeFiles/yasim-proptest.dir/TurbineEngine.cpp.o
In file included from /home/chris/fg2019_2/flightgear/src/FDM/YASim/Version.hpp:4:0,
                 from /home/chris/fg2019_2/flightgear/src/FDM/YASim/Version.cpp:5:
/home/chris/fg2019_2/flightgear/src/FDM/YASim/yasim-common.hpp:41:24: warning: ‘yasim::DEF_PROP_ELEVATOR_TRIM’ defined but not used [-Wunused-variable]
     static const char* DEF_PROP_ELEVATOR_TRIM = "/controls/flight/elevator-trim";
                        ^
[ 25%] Building CXX object src/FDM/YASim/CMakeFiles/yasim-proptest.dir/Turbulence.cpp.o
[ 25%] Building CXX object src/FDM/YASim/CMakeFiles/yasim-proptest.dir/Wing.cpp.o
In file included from /home/chris/fg2019_2/flightgear/src/FDM/YASim/Wing.cpp:1:0:
/home/chris/fg2019_2/flightgear/src/FDM/YASim/yasim-common.hpp:41:24: warning: ‘yasim::DEF_PROP_ELEVATOR_TRIM’ defined but not used [-Wunused-variable]
     static const char* DEF_PROP_ELEVATOR_TRIM = "/controls/flight/elevator-trim";
                        ^
[ 25%] Building CXX object src/GUI/CMakeFiles/fglauncher.dir/AirportDiagram.cxx.o
[ 25%] Building CXX object src/FDM/YASim/CMakeFiles/yasim-proptest.dir/Version.cpp.o
[ 25%] Linking CXX executable yasim
[ 25%] Building CXX object src/FDM/YASim/CMakeFiles/yasim-proptest.dir/yasim-common.cpp.o
[ 25%] Built target yasim
[ 25%] Building CXX object src/GUI/CMakeFiles/fglauncher.dir/NavaidDiagram.cxx.o
[ 25%] Building CXX object src/GUI/CMakeFiles/fgqmlui.dir/QtQuickFGCanvasItem.cxx.o
[ 25%] Built target fgviewer
[ 26%] Building CXX object src/GUI/CMakeFiles/fgqmlui.dir/PropertyItemModel.cxx.o
In file included from /home/chris/fg2019_2/flightgear/src/FDM/YASim/Surface.cpp:2:0:
/home/chris/fg2019_2/flightgear/src/FDM/YASim/yasim-common.hpp:41:24: warning: ‘yasim::DEF_PROP_ELEVATOR_TRIM’ defined but not used [-Wunused-variable]
     static const char* DEF_PROP_ELEVATOR_TRIM = "/controls/flight/elevator-trim";
                        ^
[ 26%] Building CXX object src/GUI/CMakeFiles/fgqmlui.dir/FGQmlInstance.cxx.o
In file included from /home/chris/fg2019_2/flightgear/src/FDM/YASim/yasim-common.cpp:1:0:
/home/chris/fg2019_2/flightgear/src/FDM/YASim/yasim-common.hpp:41:24: warning: ‘yasim::DEF_PROP_ELEVATOR_TRIM’ defined but not used [-Wunused-variable]
     static const char* DEF_PROP_ELEVATOR_TRIM = "/controls/flight/elevator-trim";
                        ^
[ 26%] Building CXX object src/GUI/CMakeFiles/fgqmlui.dir/FGQmlPropertyNode.cxx.o
In file included from /home/chris/fg2019_2/flightgear/src/FDM/YASim/Version.hpp:4:0,
                 from /home/chris/fg2019_2/flightgear/src/FDM/YASim/Version.cpp:5:
/home/chris/fg2019_2/flightgear/src/FDM/YASim/yasim-common.hpp:41:24: warning: ‘yasim::DEF_PROP_ELEVATOR_TRIM’ defined but not used [-Wunused-variable]
     static const char* DEF_PROP_ELEVATOR_TRIM = "/controls/flight/elevator-trim";
                        ^
[ 26%] Building CXX object src/GUI/CMakeFiles/fgqmlui.dir/QmlAircraftInfo.cxx.o
[ 26%] Building CXX object src/GUI/CMakeFiles/fgqmlui.dir/LocalAircraftCache.cxx.o
In file included from /home/chris/fg2019_2/flightgear/src/FDM/YASim/Wing.cpp:1:0:
/home/chris/fg2019_2/flightgear/src/FDM/YASim/yasim-common.hpp:41:24: warning: ‘yasim::DEF_PROP_ELEVATOR_TRIM’ defined but not used [-Wunused-variable]
     static const char* DEF_PROP_ELEVATOR_TRIM = "/controls/flight/elevator-trim";
                        ^
[ 28%] Linking CXX executable yasim-proptest
[ 28%] Built target yasim-proptest
[ 28%] Building CXX object src/GUI/CMakeFiles/fgqmlui.dir/PreviewImageItem.cxx.o
/home/chris/fg2019_2/flightgear/src/GUI/PropertyItemModel.cxx: In member function ‘virtual QVariant PropertyItemModel::data(const QModelIndex&, int) const’:
/home/chris/fg2019_2/flightgear/src/GUI/PropertyItemModel.cxx:70:21: warning: comparison between signed and unsigned integer expressions [-Wsign-compare]
     if (index.row() >= _nodes.size())
                     ^
[ 28%] Building CXX object src/GUI/CMakeFiles/fgqmlui.dir/ThumbnailImageItem.cxx.o
[ 28%] Building CXX object src/FDM/JSBSim/CMakeFiles/JSBSim.dir/initialization/FGTrim.cpp.o
[ 28%] Building CXX object src/GUI/CMakeFiles/fglauncher.dir/SetupRootDialog.cxx.o
[ 28%] Building CXX object src/GUI/CMakeFiles/fgqmlui.dir/PopupWindowTracker.cxx.o
[ 28%] Building CXX object src/GUI/CMakeFiles/fgqmlui.dir/QmlPositioned.cxx.o
[ 28%] Building CXX object src/GUI/CMakeFiles/fglauncher.dir/AircraftModel.cxx.o
[ 28%] Building CXX object src/GUI/CMakeFiles/fgqmlui.dir/QmlNavCacheWrapper.cxx.o
[ 28%] Building CXX object src/GUI/CMakeFiles/fgqmlui.dir/QmlRadioButtonHelper.cxx.o
[ 28%] Building CXX object src/GUI/CMakeFiles/fglauncher.dir/CatalogListModel.cxx.o
[ 28%] Building CXX object src/GUI/CMakeFiles/fgqmlui.dir/UnitsModel.cxx.o
[ 28%] Building CXX object src/GUI/CMakeFiles/fgqmlui.dir/NavaidSearchModel.cxx.o
[ 28%] Building CXX object src/GUI/CMakeFiles/fgqmlui.dir/FlightPlanController.cxx.o
[ 28%] Building CXX object src/FDM/JSBSim/CMakeFiles/JSBSim.dir/initialization/FGTrimAxis.cpp.o
[ 30%] Building CXX object src/GUI/CMakeFiles/fgqmlui.dir/RouteDiagram.cxx.o
/home/chris/fg2019_2/flightgear/src/GUI/UnitsModel.cxx: In member function ‘virtual QVariant UnitsModel::data(const QModelIndex&, int) const’:
/home/chris/fg2019_2/flightgear/src/GUI/UnitsModel.cxx:129:27: warning: comparison between signed and unsigned integer expressions [-Wsign-compare]
     if ((row < 0) || (row >= m_enabledUnits.size()))
                           ^
/home/chris/fg2019_2/flightgear/src/GUI/UnitsModel.cxx: In member function ‘void UnitsModel::setSelectedIndex(int)’:
/home/chris/fg2019_2/flightgear/src/GUI/UnitsModel.cxx:270:23: warning: comparison between signed and unsigned integer expressions [-Wsign-compare]
     if (m_activeIndex == selectedIndex)
                       ^
/home/chris/fg2019_2/flightgear/src/GUI/UnitsModel.cxx:273:47: warning: comparison between signed and unsigned integer expressions [-Wsign-compare]
     if ((selectedIndex < 0) || (selectedIndex >= m_enabledUnits.size()))
                                               ^
[ 30%] Building CXX object src/GUI/CMakeFiles/fgqmlui.dir/ModelDataExtractor.cxx.o
[ 31%] Building CXX object src/FDM/JSBSim/CMakeFiles/JSBSim.dir/input_output/FGGroundCallback.cpp.o
[ 31%] Building CXX object src/FDM/JSBSim/CMakeFiles/JSBSim.dir/input_output/FGPropertyReader.cpp.o
[ 31%] Building CXX object src/GUI/CMakeFiles/fglauncher.dir/QtMessageBox.cxx.o
[ 31%] Building CXX object src/GUI/CMakeFiles/fglauncher.dir/QtFileDialog.cxx.o
/home/chris/fg2019_2/flightgear/src/GUI/CatalogListModel.cxx: In member function ‘void CatalogListModel::removeCatalog(int)’:
/home/chris/fg2019_2/flightgear/src/GUI/CatalogListModel.cxx:177:31: warning: comparison between signed and unsigned integer expressions [-Wsign-compare]
     if ((index < 0) || (index >= m_catalogs.size())) {
                               ^
/home/chris/fg2019_2/flightgear/src/GUI/CatalogListModel.cxx: In member function ‘void CatalogListModel::refreshCatalog(int)’:
/home/chris/fg2019_2/flightgear/src/GUI/CatalogListModel.cxx:188:31: warning: comparison between signed and unsigned integer expressions [-Wsign-compare]
     if ((index < 0) || (index >= m_catalogs.size())) {
                               ^
[ 31%] Building CXX object src/FDM/JSBSim/CMakeFiles/JSBSim.dir/input_output/FGPropertyManager.cpp.o
[ 31%] Building CXX object src/FDM/JSBSim/CMakeFiles/JSBSim.dir/input_output/FGScript.cpp.o
/home/chris/fg2019_2/flightgear/src/GUI/NavaidSearchModel.cxx: In member function ‘qlonglong NavaidSearchModel::guidAtIndex(int) const’:
/home/chris/fg2019_2/flightgear/src/GUI/NavaidSearchModel.cxx:153:31: warning: comparison between signed and unsigned integer expressions [-Wsign-compare]
     if ((index < 0) || (index >= m_ids.size()))
                               ^
[ 31%] Linking C static library libfgsqlite3.a
[ 31%] Built target fgsqlite3
[ 31%] Building CXX object src/FDM/JSBSim/CMakeFiles/JSBSim.dir/input_output/FGXMLElement.cpp.o
[ 31%] Building CXX object src/FDM/JSBSim/CMakeFiles/JSBSim.dir/input_output/FGXMLParse.cpp.o
[ 31%] Building CXX object src/FDM/JSBSim/CMakeFiles/JSBSim.dir/input_output/FGfdmSocket.cpp.o
[ 31%] Building CXX object src/GUI/CMakeFiles/fglauncher.dir/InstallSceneryDialog.cxx.o
[ 33%] Building CXX object src/GUI/CMakeFiles/fglauncher.dir/LocationController.cxx.o
[ 33%] Building CXX object src/GUI/CMakeFiles/fglauncher.dir/LauncherArgumentTokenizer.cxx.o
[ 33%] Building CXX object src/FDM/JSBSim/CMakeFiles/JSBSim.dir/input_output/FGInputType.cpp.o
[ 33%] Building CXX object src/FDM/JSBSim/CMakeFiles/JSBSim.dir/input_output/FGInputSocket.cpp.o
[ 33%] Building CXX object src/FDM/JSBSim/CMakeFiles/JSBSim.dir/input_output/FGUDPInputSocket.cpp.o
[ 33%] Building CXX object src/FDM/JSBSim/CMakeFiles/JSBSim.dir/input_output/FGOutputFG.cpp.o
[ 33%] Building CXX object src/FDM/JSBSim/CMakeFiles/JSBSim.dir/input_output/FGOutputFile.cpp.o
[ 33%] Linking CXX static library libfgqmlui.a
[ 33%] Building CXX object src/GUI/CMakeFiles/fglauncher.dir/AircraftSearchFilterModel.cxx.o
[ 33%] Built target fgqmlui
[ 33%] Building CXX object src/GUI/CMakeFiles/fglauncher.dir/DefaultAircraftLocator.cxx.o
[ 33%] Building CXX object src/FDM/JSBSim/CMakeFiles/JSBSim.dir/input_output/FGOutputSocket.cpp.o
[ 33%] Building CXX object src/FDM/JSBSim/CMakeFiles/JSBSim.dir/input_output/FGOutputTextFile.cpp.o
[ 35%] Building CXX object src/FDM/JSBSim/CMakeFiles/JSBSim.dir/input_output/FGOutputType.cpp.o
[ 35%] Building CXX object src/FDM/JSBSim/CMakeFiles/JSBSim.dir/input_output/FGModelLoader.cpp.o
/home/chris/fg2019_2/flightgear/src/GUI/DefaultAircraftLocator.cxx: In member function ‘virtual QVariant flightgear::WeatherScenariosModel::data(const QModelIndex&, int) const’:
/home/chris/fg2019_2/flightgear/src/GUI/DefaultAircraftLocator.cxx:123:27: warning: comparison between signed and unsigned integer expressions [-Wsign-compare]
     if ((row < 0) || (row >= m_scenarios.size())) {
                           ^
[ 35%] Building CXX object src/FDM/JSBSim/CMakeFiles/JSBSim.dir/math/FGColumnVector3.cpp.o
[ 35%] Building CXX object src/GUI/CMakeFiles/fglauncher.dir/LaunchConfig.cxx.o
[ 35%] Building CXX object src/FDM/JSBSim/CMakeFiles/JSBSim.dir/math/FGCondition.cpp.o
[ 35%] Building CXX object src/GUI/CMakeFiles/fglauncher.dir/MPServersModel.cpp.o
[ 35%] Building CXX object src/FDM/JSBSim/CMakeFiles/JSBSim.dir/math/FGFunction.cpp.o
[ 35%] Building CXX object src/GUI/CMakeFiles/fglauncher.dir/PathUrlHelper.cxx.o
[ 35%] Building CXX object src/GUI/CMakeFiles/fglauncher.dir/RecentAircraftModel.cxx.o
[ 35%] Building CXX object src/FDM/JSBSim/CMakeFiles/JSBSim.dir/math/FGLocation.cpp.o
[ 35%] Building CXX object src/FDM/JSBSim/CMakeFiles/JSBSim.dir/math/FGMatrix33.cpp.o
[ 35%] Building CXX object src/FDM/JSBSim/CMakeFiles/JSBSim.dir/math/FGModelFunctions.cpp.o
[ 35%] Building CXX object src/FDM/JSBSim/CMakeFiles/JSBSim.dir/math/FGPropertyValue.cpp.o
[ 35%] Building CXX object src/FDM/JSBSim/CMakeFiles/JSBSim.dir/math/FGQuaternion.cpp.o
/home/chris/fg2019_2/flightgear/src/GUI/MPServersModel.cpp: In member function ‘QString MPServersModel::currentServer() const’:
/home/chris/fg2019_2/flightgear/src/GUI/MPServersModel.cpp:184:24: warning: comparison between signed and unsigned integer expressions [-Wsign-compare]
     if (m_currentIndex == m_servers.size()) {
                        ^
[ 35%] Building CXX object src/GUI/CMakeFiles/fglauncher.dir/RecentLocationsModel.cxx.o
[ 35%] Building CXX object src/FDM/JSBSim/CMakeFiles/JSBSim.dir/math/FGRealValue.cpp.o
[ 35%] Building CXX object src/FDM/JSBSim/CMakeFiles/JSBSim.dir/math/FGRungeKutta.cpp.o
[ 35%] Building CXX object src/FDM/JSBSim/CMakeFiles/JSBSim.dir/math/FGTable.cpp.o
[ 35%] Building CXX object src/GUI/CMakeFiles/fglauncher.dir/LauncherController.cxx.o
[ 35%] Building CXX object src/GUI/CMakeFiles/fglauncher.dir/AddOnsController.cxx.o
[ 35%] Building CXX object src/FDM/JSBSim/CMakeFiles/JSBSim.dir/math/FGTemplateFunc.cpp.o
[ 35%] Building CXX object src/FDM/JSBSim/CMakeFiles/JSBSim.dir/models/FGAccelerations.cpp.o
[ 36%] Building CXX object src/FDM/JSBSim/CMakeFiles/JSBSim.dir/models/FGAerodynamics.cpp.o
[ 36%] Building CXX object src/GUI/CMakeFiles/fglauncher.dir/AddonsModel.cxx.o
[ 36%] Building CXX object src/FDM/JSBSim/CMakeFiles/JSBSim.dir/models/FGAircraft.cpp.o
[ 36%] Building CXX object src/GUI/CMakeFiles/fglauncher.dir/PixmapImageItem.cxx.o
[ 36%] Building CXX object src/FDM/JSBSim/CMakeFiles/JSBSim.dir/models/FGAtmosphere.cpp.o
[ 36%] Building CXX object src/FDM/JSBSim/CMakeFiles/JSBSim.dir/models/FGAuxiliary.cpp.o
[ 36%] Building CXX object src/GUI/CMakeFiles/fglauncher.dir/qrc_resources.cpp.o
[ 36%] Building CXX object src/FDM/JSBSim/CMakeFiles/JSBSim.dir/models/FGBuoyantForces.cpp.o
[ 36%] Building CXX object src/FDM/JSBSim/CMakeFiles/JSBSim.dir/models/FGExternalForce.cpp.o
[ 36%] Building CXX object src/FDM/JSBSim/CMakeFiles/JSBSim.dir/models/FGExternalReactions.cpp.o
[ 36%] Building CXX object src/FDM/JSBSim/CMakeFiles/JSBSim.dir/models/FGFCS.cpp.o
[ 36%] Building CXX object src/FDM/JSBSim/CMakeFiles/JSBSim.dir/models/FGGasCell.cpp.o
[ 36%] Building CXX object src/FDM/JSBSim/CMakeFiles/JSBSim.dir/models/FGSurface.cpp.o
[ 36%] Building CXX object src/FDM/JSBSim/CMakeFiles/JSBSim.dir/models/FGGroundReactions.cpp.o
[ 36%] Building CXX object src/FDM/JSBSim/CMakeFiles/JSBSim.dir/models/FGInertial.cpp.o
[ 36%] Building CXX object src/FDM/JSBSim/CMakeFiles/JSBSim.dir/models/FGInput.cpp.o
[ 36%] Building CXX object src/FDM/JSBSim/CMakeFiles/JSBSim.dir/models/FGLGear.cpp.o
[ 36%] Building CXX object src/FDM/JSBSim/CMakeFiles/JSBSim.dir/models/FGMassBalance.cpp.o
[ 38%] Building CXX object src/FDM/JSBSim/CMakeFiles/JSBSim.dir/models/FGModel.cpp.o
[ 38%] Building CXX object src/FDM/JSBSim/CMakeFiles/JSBSim.dir/models/FGOutput.cpp.o
[ 38%] Building CXX object src/FDM/JSBSim/CMakeFiles/JSBSim.dir/models/FGPropagate.cpp.o
[ 38%] Building CXX object src/FDM/JSBSim/CMakeFiles/JSBSim.dir/models/FGPropulsion.cpp.o
[ 38%] Building CXX object src/FDM/JSBSim/CMakeFiles/JSBSim.dir/models/atmosphere/FGMSIS.cpp.o
[ 38%] Building CXX object src/FDM/JSBSim/CMakeFiles/JSBSim.dir/models/atmosphere/FGMSISData.cpp.o
[ 38%] Building CXX object src/FDM/JSBSim/CMakeFiles/JSBSim.dir/models/atmosphere/FGStandardAtmosphere.cpp.o
[ 38%] Building CXX object src/FDM/JSBSim/CMakeFiles/JSBSim.dir/models/atmosphere/FGMars.cpp.o
[ 38%] Building CXX object src/FDM/JSBSim/CMakeFiles/JSBSim.dir/models/atmosphere/FGWinds.cpp.o
[ 38%] Building CXX object src/FDM/JSBSim/CMakeFiles/JSBSim.dir/models/flight_control/FGAccelerometer.cpp.o
[ 38%] Building CXX object src/FDM/JSBSim/CMakeFiles/JSBSim.dir/models/flight_control/FGActuator.cpp.o
[ 38%] Building CXX object src/FDM/JSBSim/CMakeFiles/JSBSim.dir/models/flight_control/FGAngles.cpp.o
[ 38%] Building CXX object src/FDM/JSBSim/CMakeFiles/JSBSim.dir/models/flight_control/FGDeadBand.cpp.o
[ 38%] Building CXX object src/FDM/JSBSim/CMakeFiles/JSBSim.dir/models/flight_control/FGFCSComponent.cpp.o
[ 40%] Building CXX object src/FDM/JSBSim/CMakeFiles/JSBSim.dir/models/flight_control/FGFCSFunction.cpp.o
[ 40%] Building CXX object src/FDM/JSBSim/CMakeFiles/JSBSim.dir/models/flight_control/FGFilter.cpp.o
[ 40%] Building CXX object src/FDM/JSBSim/CMakeFiles/JSBSim.dir/models/flight_control/FGGain.cpp.o
[ 40%] Linking CXX static library libfglauncher.a
[ 40%] Building CXX object src/FDM/JSBSim/CMakeFiles/JSBSim.dir/models/flight_control/FGGyro.cpp.o
[ 41%] Built target fglauncher
[ 41%] Building CXX object src/FDM/JSBSim/CMakeFiles/JSBSim.dir/models/flight_control/FGKinemat.cpp.o
[ 41%] Building CXX object src/FDM/JSBSim/CMakeFiles/JSBSim.dir/models/flight_control/FGMagnetometer.cpp.o
[ 41%] Building CXX object src/FDM/JSBSim/CMakeFiles/JSBSim.dir/models/flight_control/FGPID.cpp.o
[ 41%] Building CXX object src/FDM/JSBSim/CMakeFiles/JSBSim.dir/models/flight_control/FGSensor.cpp.o
[ 41%] Building CXX object src/FDM/JSBSim/CMakeFiles/JSBSim.dir/models/flight_control/FGSummer.cpp.o
[ 41%] Building CXX object src/FDM/JSBSim/CMakeFiles/JSBSim.dir/models/flight_control/FGSwitch.cpp.o
[ 41%] Building CXX object src/FDM/JSBSim/CMakeFiles/JSBSim.dir/models/flight_control/FGWaypoint.cpp.o
[ 41%] Building CXX object src/FDM/JSBSim/CMakeFiles/JSBSim.dir/models/flight_control/FGDistributor.cpp.o
[ 41%] Building CXX object src/FDM/JSBSim/CMakeFiles/JSBSim.dir/models/flight_control/FGLinearActuator.cpp.o
[ 41%] Building CXX object src/FDM/JSBSim/CMakeFiles/JSBSim.dir/models/propulsion/FGElectric.cpp.o
[ 41%] Building CXX object src/FDM/JSBSim/CMakeFiles/JSBSim.dir/models/propulsion/FGEngine.cpp.o
[ 43%] Building CXX object src/FDM/JSBSim/CMakeFiles/JSBSim.dir/models/propulsion/FGForce.cpp.o
[ 43%] Building CXX object src/FDM/JSBSim/CMakeFiles/JSBSim.dir/models/propulsion/FGPiston.cpp.o
[ 43%] Building CXX object src/FDM/JSBSim/CMakeFiles/JSBSim.dir/models/propulsion/FGNozzle.cpp.o
[ 43%] Building CXX object src/FDM/JSBSim/CMakeFiles/JSBSim.dir/models/propulsion/FGPropeller.cpp.o
[ 43%] Building CXX object src/FDM/JSBSim/CMakeFiles/JSBSim.dir/models/propulsion/FGRocket.cpp.o
[ 43%] Building CXX object src/FDM/JSBSim/CMakeFiles/JSBSim.dir/models/propulsion/FGRotor.cpp.o
[ 43%] Building CXX object src/FDM/JSBSim/CMakeFiles/JSBSim.dir/models/propulsion/FGTank.cpp.o
[ 43%] Building CXX object src/FDM/JSBSim/CMakeFiles/JSBSim.dir/models/propulsion/FGThruster.cpp.o
[ 43%] Building CXX object src/FDM/JSBSim/CMakeFiles/JSBSim.dir/models/propulsion/FGTransmission.cpp.o
[ 43%] Building CXX object src/FDM/JSBSim/CMakeFiles/JSBSim.dir/models/propulsion/FGTurbine.cpp.o
[ 43%] Building CXX object src/FDM/JSBSim/CMakeFiles/JSBSim.dir/models/propulsion/FGTurboProp.cpp.o
[ 43%] Linking CXX static library libJSBSim.a
[ 43%] Built target JSBSim
Makefile:162 : la recette pour la cible « all » a échouée
make: *** [all] Erreur 2
INSTALL flightgear
[  0%] Built target fgsqlite3
[  8%] Built target iaxclient_lib
[ 13%] Built target flite_hts
[ 13%] Built target hts_engine
[ 13%] Built target PLIBJoystick
[ 13%] Built target fgelev
[ 13%] Linking CXX executable fgpanel
/usr/bin/ld: /usr/lib/gcc/x86_64-linux-gnu/5/../../../x86_64-linux-gnu/libGL.so: référence au symbole non défini « XextAddDisplay »
//usr/lib/x86_64-linux-gnu/libXext.so.6: error adding symbols: DSO manquant dans la ligne de commande
collect2: error: ld returned 1 exit status
utils/fgpanel/CMakeFiles/fgpanel.dir/build.make:394 : la recette pour la cible « utils/fgpanel/fgpanel » a échouée
make[2]: *** [utils/fgpanel/fgpanel] Erreur 1
CMakeFiles/Makefile2:688 : la recette pour la cible « utils/fgpanel/CMakeFiles/fgpanel.dir/all » a échouée
make[1]: *** [utils/fgpanel/CMakeFiles/fgpanel.dir/all] Erreur 2
Makefile:162 : la recette pour la cible « all » a échouée
make: *** [all] Erreur 2
***********************************
All optional package alternatives have found a matching package.

Fg 2019.2.0 - LinuxMint 19.1 Tessa - CM Asus P8H67 MLE - CPU i3 2100T - 12 Go Ram - Nvidia Geforce GTX 770 - Driver Nvidia 430.26
+ Hp notebook-15-da0118nf -  CPU i3-7020u - Ram 4Go - Intel Graphics 620.

Hors ligne

#9 19/03/2019 20:41:11

ctesc356
Membre
Inscription : 18/05/2010
Messages : 2 745

Re : Erreur compilation FGFS

Et une compilation dans un dossier vierge, sans Cmake?


Intel i5 3570 3.4Mhz, Nvidia GTX 660, 8Go Ram, Linux Mint

Hors ligne

#10 19/03/2019 21:35:16

f-toro
Administrateur
Lieu : LFLA
Inscription : 16/12/2007
Messages : 2 522

Re : Erreur compilation FGFS

ctesc356 a écrit :

Et une compilation dans un dossier vierge, sans Cmake?

C'est ce que je disais aussi...

f-toro a écrit :

Attention, avant de recompiler, il faut vider entièrement le nouveau répertoire fg2019_2, sauf le script d&c (et éventuellement le data).

On aimerait avoir le résultat de l'essai, avec

ctesc356 a écrit :

juste PLIB SIMGEAR FGFS


André. anciennement taureau89_9
Debian Testing Amd64. CM Sabertooth 990FX, FX8350, 32 Go Ram DDR3 1866 Mhz, GTX 750ti 2Go, DD 2To Sata 3, THRUSTMASTER T.Flight StickX, FG 2019.2.0 Git.

Hors ligne

#11 20/03/2019 9:01:11

Clm76
Membre
Lieu : LFOH
Inscription : 22/10/2012
Messages : 1 048

Re : Erreur compilation FGFS

Résultat de la compilation de PLIB SIMGEAR et FGFS dans un répertoire vierge (avec juste d&c) :
PLIB : ok
SIMGEAR : Pas bon

./download_and_compile.sh SIMGEAR
VERSION=$Id
APT_GET_UPDATE=y
DOWNLOAD_PACKAGES=y
COMPILE=y
RECONFIGURE=y
DOWNLOAD=y
JOPTION= -j12 
OOPTION=
BUILD_TYPE=RelWithDebInfo
***********************************
Considering a package alternative: libcurl4-openssl-dev libcurl4-gnutls-dev
Package alternative matched for libcurl4-openssl-dev
Considering a package alternative: libopenscenegraph-3.4-dev libopenscenegraph-dev libopenscenegraph-[0-9]+\.[0-9]+-dev
Package alternative matched for libopenscenegraph-dev
Considering a package alternative: libpng-dev libpng12-dev libpng16-dev
Package alternative matched for libpng12-dev
Considering an optional package alternative: qml-module-qtquick2
Optional package alternative matched for qml-module-qtquick2
Considering an optional package alternative: qml-module-qtquick-window2
Optional package alternative matched for qml-module-qtquick-window2
Considering an optional package alternative: qml-module-qtquick-dialogs
Optional package alternative matched for qml-module-qtquick-dialogs
Considering an optional package alternative: qtbase5-private-dev
Optional package alternative matched for qtbase5-private-dev
Considering an optional package alternative: qtdeclarative5-private-dev
Optional package alternative matched for qtdeclarative5-private-dev
DIRECTORY= /home/chris/fg2019_2
***********************************
****************************************
**************** SIMGEAR ***************
****************************************
-- CMAKE Build type: RelWithDebInfo
-- The C compiler identification is GNU 5.4.0
-- The CXX compiler identification is GNU 5.4.0
-- Check for working C compiler: /usr/bin/cc
-- Check for working C compiler: /usr/bin/cc -- works
-- Detecting C compiler ABI info
-- Detecting C compiler ABI info - done
-- Detecting C compile features
-- Detecting C compile features - done
-- Check for working CXX compiler: /usr/bin/c++
-- Check for working CXX compiler: /usr/bin/c++ -- works
-- Detecting CXX compiler ABI info
-- Detecting CXX compiler ABI info - done
-- Detecting CXX compile features
-- Detecting CXX compile features - done
-- version is 2019 dot 2 dot 0
-- Library installation directory: lib
-- Looking for pthread.h
-- Looking for pthread.h - found
-- Looking for pthread_create
-- Looking for pthread_create - not found
-- Looking for pthread_create in pthreads
-- Looking for pthread_create in pthreads - not found
-- Looking for pthread_create in pthread
-- Looking for pthread_create in pthread - found
-- Found Threads: TRUE  
-- Boost version: 1.58.0
-- SimGear mode: NORMAL
-- Found OpenGL: /usr/lib/x86_64-linux-gnu/libGL.so  
-- Found OpenAL: /usr/lib/x86_64-linux-gnu/libopenal.so  
-- Sound support: OpenAL
-- Found osgText: /usr/lib/x86_64-linux-gnu/libosgText.so  
-- Found osgSim: /usr/lib/x86_64-linux-gnu/libosgSim.so  
-- Found osgDB: /usr/lib/x86_64-linux-gnu/libosgDB.so  
-- Found osgParticle: /usr/lib/x86_64-linux-gnu/libosgParticle.so  
-- Found osgGA: /usr/lib/x86_64-linux-gnu/libosgGA.so  
-- Found osgViewer: /usr/lib/x86_64-linux-gnu/libosgViewer.so  
-- Found osgUtil: /usr/lib/x86_64-linux-gnu/libosgUtil.so  
-- Found osg: /usr/lib/x86_64-linux-gnu/libosg.so  
-- Found OpenThreads: /usr/lib/x86_64-linux-gnu/libOpenThreads.so  
-- Found OpenSceneGraph: /usr/lib/x86_64-linux-gnu/libosgText.so;/usr/lib/x86_64-linux-gnu/libosgSim.so;/usr/lib/x86_64-linux-gnu/libosgDB.so;/usr/lib/x86_64-linux-gnu/libosgParticle.so;/usr/lib/x86_64-linux-gnu/libosgGA.so;/usr/lib/x86_64-linux-gnu/libosgViewer.so;/usr/lib/x86_64-linux-gnu/libosgUtil.so;/usr/lib/x86_64-linux-gnu/libosg.so;/usr/lib/x86_64-linux-gnu/libOpenThreads.so (found suitable version "3.2.1", minimum required is "3.2.0") 
-- Found ZLIB: /usr/lib/x86_64-linux-gnu/libz.so (found suitable version "1.2.8", minimum required is "1.2.4") 
-- Found CURL: /usr/lib/x86_64-linux-gnu/libcurl.so (found version "7.47.0") 
-- Using built-in expat code
-- Looking for inttypes.h
-- Looking for inttypes.h - found
-- Looking for sys/time.h
-- Looking for sys/time.h - found
-- Looking for unistd.h
-- Looking for unistd.h - found
-- Looking for windows.h
-- Looking for windows.h - not found
-- RTI: DISABLED
-- Looking for gettimeofday
-- Looking for gettimeofday - found
-- Looking for rint
-- Looking for rint - not found
-- Looking for mkdtemp
-- Looking for mkdtemp - found
-- Looking for bcopy
-- Looking for bcopy - found
-- Looking for mmap
-- Looking for mmap - found
-- Looking for timegm
-- Looking for timegm - found
-- Performing Test HAVE_CLOCK_GETTIME
-- Performing Test HAVE_CLOCK_GETTIME - Success
-- Looking for clock_gettime in rt
-- Looking for clock_gettime in rt - found
-- Performing Test HAVE_DLFCN_H
-- Performing Test HAVE_DLFCN_H - Success
-- Looking for dlerror in dl
-- Looking for dlerror in dl - found
-- Performing Test HAVE_STD_ISNAN
-- Performing Test HAVE_STD_ISNAN - Success
-- Performing Test HAVE_WORKING_STD_REGEX
-- Performing Test HAVE_WORKING_STD_REGEX - Success
-- Performing Test GCC_ATOMIC_BUILTINS_FOUND
-- Performing Test GCC_ATOMIC_BUILTINS_FOUND - Success
-- OpenMP: DISABLED
-- Performing Test HAS_NOWARN_UNUSED_TYPEDEFS
-- Performing Test HAS_NOWARN_UNUSED_TYPEDEFS - Success
-- Performing Test HAVE_STD_INDEX_SEQUENCE
-- Performing Test HAVE_STD_INDEX_SEQUENCE - Failed
-- Performing Test HAVE_STD_REMOVE_CV_T
-- Performing Test HAVE_STD_REMOVE_CV_T - Failed
-- Performing Test HAVE_STD_REMOVE_CVREF_T
-- Performing Test HAVE_STD_REMOVE_CVREF_T - Failed
-- Performing Test HAVE_STD_ENABLE_IF_T
-- Performing Test HAVE_STD_ENABLE_IF_T - Failed
-- Performing Test HAVE_STD_BOOL_CONSTANT
-- Performing Test HAVE_STD_BOOL_CONSTANT - Failed
-- Tests: ENABLED
-- DNS resolver: ENABLED
-- Looking for poll
-- Looking for poll - found
-- Looking for getopt
-- Looking for getopt - found
-- Looking for inet_ntop
-- Looking for inet_ntop - found
-- Looking for AF_INET6
-- Looking for AF_INET6 - found
-- Looking for windows.h
-- Looking for windows.h - not found
-- Library building mode: STATIC LIBRARIES
-- Performing Test COMPILER_HAS_HIDDEN_VISIBILITY
-- Performing Test COMPILER_HAS_HIDDEN_VISIBILITY - Success
-- Performing Test COMPILER_HAS_HIDDEN_INLINE_VISIBILITY
-- Performing Test COMPILER_HAS_HIDDEN_INLINE_VISIBILITY - Success
-- Performing Test COMPILER_HAS_DEPRECATED_ATTR
-- Performing Test COMPILER_HAS_DEPRECATED_ATTR - Success
-- Configuring done
-- Generating done
-- Build files have been written to: /home/chris/fg2019_2/build/simgear
MAKE simgear
Scanning dependencies of target SimGearCore
[  0%] Building C object simgear/CMakeFiles/SimGearCore.dir/__/3rdparty/udns/udns_parse.c.o
[  0%] Building C object simgear/CMakeFiles/SimGearCore.dir/__/3rdparty/udns/udns_dntosp.c.o
[  0%] Building C object simgear/CMakeFiles/SimGearCore.dir/__/3rdparty/udns/udns_resolver.c.o
[  0%] Building C object simgear/CMakeFiles/SimGearCore.dir/__/3rdparty/udns/udns_init.c.o
[  0%] Building C object simgear/CMakeFiles/SimGearCore.dir/__/3rdparty/udns/udns_rr_mx.c.o
[  1%] Building C object simgear/CMakeFiles/SimGearCore.dir/__/3rdparty/udns/udns_dn.c.o
[  1%] Building C object simgear/CMakeFiles/SimGearCore.dir/__/3rdparty/udns/udns_rr_srv.c.o
[  1%] Building C object simgear/CMakeFiles/SimGearCore.dir/__/3rdparty/udns/udns_rr_ptr.c.o
[  2%] Building C object simgear/CMakeFiles/SimGearCore.dir/__/3rdparty/udns/udns_misc.c.o
[  2%] Building C object simgear/CMakeFiles/SimGearCore.dir/__/3rdparty/udns/udns_bl.c.o
[  3%] Building C object simgear/CMakeFiles/SimGearCore.dir/__/3rdparty/udns/udns_rr_txt.c.o
[  1%] Building C object simgear/CMakeFiles/SimGearCore.dir/__/3rdparty/udns/udns_rr_a.c.o
[  3%] Building C object simgear/CMakeFiles/SimGearCore.dir/__/3rdparty/udns/udns_rr_naptr.c.o
[  3%] Building C object simgear/CMakeFiles/SimGearCore.dir/__/3rdparty/udns/udns_jran.c.o
[  4%] Building C object simgear/CMakeFiles/SimGearCore.dir/__/3rdparty/udns/udns_codes.c.o
[  4%] Building CXX object simgear/CMakeFiles/SimGearCore.dir/bucket/newbucket.cxx.o
[  5%] Building CXX object simgear/CMakeFiles/SimGearCore.dir/bvh/BVHGroup.cxx.o
[  5%] Building C object simgear/CMakeFiles/SimGearCore.dir/__/3rdparty/udns/udns_XtoX.c.o
[  5%] Building CXX object simgear/CMakeFiles/SimGearCore.dir/bvh/BVHLineSegmentVisitor.cxx.o
[  5%] Building CXX object simgear/CMakeFiles/SimGearCore.dir/bvh/BVHLineGeometry.cxx.o
[  5%] Building CXX object simgear/CMakeFiles/SimGearCore.dir/bvh/BVHMotionTransform.cxx.o
[  5%] Building CXX object simgear/CMakeFiles/SimGearCore.dir/bvh/BVHPageNode.cxx.o
[  5%] Building CXX object simgear/CMakeFiles/SimGearCore.dir/bvh/BVHPageRequest.cxx.o
[  6%] Building CXX object simgear/CMakeFiles/SimGearCore.dir/bvh/BVHNode.cxx.o
[  6%] Building CXX object simgear/CMakeFiles/SimGearCore.dir/bvh/BVHStaticBinary.cxx.o
[  7%] Building CXX object simgear/CMakeFiles/SimGearCore.dir/bvh/BVHPager.cxx.o
[  7%] Building CXX object simgear/CMakeFiles/SimGearCore.dir/bvh/BVHStaticGeometry.cxx.o
[  7%] Building CXX object simgear/CMakeFiles/SimGearCore.dir/bvh/BVHStaticLeaf.cxx.o
[  8%] Building CXX object simgear/CMakeFiles/SimGearCore.dir/bvh/BVHStaticNode.cxx.o
[  8%] Building CXX object simgear/CMakeFiles/SimGearCore.dir/bvh/BVHStaticTriangle.cxx.o
[  8%] Building CXX object simgear/CMakeFiles/SimGearCore.dir/bvh/BVHSubTreeCollector.cxx.o
[  8%] Building CXX object simgear/CMakeFiles/SimGearCore.dir/bvh/BVHMaterial.cxx.o
[  9%] Building CXX object simgear/CMakeFiles/SimGearCore.dir/bvh/BVHTransform.cxx.o
[  9%] Building CXX object simgear/CMakeFiles/SimGearCore.dir/debug/logstream.cxx.o
[  9%] Building CXX object simgear/CMakeFiles/SimGearCore.dir/debug/BufferedLogCallback.cxx.o
[  9%] Building CXX object simgear/CMakeFiles/SimGearCore.dir/embedded_resources/EmbeddedResource.cxx.o
[ 10%] Building CXX object simgear/CMakeFiles/SimGearCore.dir/embedded_resources/EmbeddedResourceManager.cxx.o
[ 10%] Building CXX object simgear/CMakeFiles/SimGearCore.dir/embedded_resources/EmbeddedResourceProxy.cxx.o
[ 10%] Building CXX object simgear/CMakeFiles/SimGearCore.dir/ephemeris/celestialBody.cxx.o
[ 10%] Building CXX object simgear/CMakeFiles/SimGearCore.dir/ephemeris/ephemeris.cxx.o
[ 11%] Building CXX object simgear/CMakeFiles/SimGearCore.dir/ephemeris/jupiter.cxx.o
[ 11%] Building CXX object simgear/CMakeFiles/SimGearCore.dir/ephemeris/mars.cxx.o
[ 11%] Building CXX object simgear/CMakeFiles/SimGearCore.dir/ephemeris/mercury.cxx.o
[ 11%] Building CXX object simgear/CMakeFiles/SimGearCore.dir/ephemeris/moonpos.cxx.o
[ 12%] Building CXX object simgear/CMakeFiles/SimGearCore.dir/ephemeris/neptune.cxx.o
[ 12%] Building CXX object simgear/CMakeFiles/SimGearCore.dir/ephemeris/saturn.cxx.o
[ 12%] Building CXX object simgear/CMakeFiles/SimGearCore.dir/ephemeris/star.cxx.o
[ 12%] Building CXX object simgear/CMakeFiles/SimGearCore.dir/ephemeris/stardata.cxx.o
[ 13%] Building CXX object simgear/CMakeFiles/SimGearCore.dir/ephemeris/uranus.cxx.o
[ 13%] Building CXX object simgear/CMakeFiles/SimGearCore.dir/ephemeris/venus.cxx.o
[ 13%] Building CXX object simgear/CMakeFiles/SimGearCore.dir/io/iostreams/sgstream.cxx.o
[ 14%] Building CXX object simgear/CMakeFiles/SimGearCore.dir/io/iostreams/gzfstream.cxx.o
[ 14%] Building CXX object simgear/CMakeFiles/SimGearCore.dir/io/iostreams/gzcontainerfile.cxx.o
[ 14%] Building CXX object simgear/CMakeFiles/SimGearCore.dir/io/iostreams/CharArrayStream.cxx.o
[ 14%] Building CXX object simgear/CMakeFiles/SimGearCore.dir/io/iostreams/zlibstream.cxx.o
[ 15%] Building CXX object simgear/CMakeFiles/SimGearCore.dir/io/iochannel.cxx.o
[ 15%] Building CXX object simgear/CMakeFiles/SimGearCore.dir/io/lowlevel.cxx.o
[ 15%] Building CXX object simgear/CMakeFiles/SimGearCore.dir/io/sg_binobj.cxx.o
[ 15%] Building CXX object simgear/CMakeFiles/SimGearCore.dir/io/raw_socket.cxx.o
[ 16%] Building CXX object simgear/CMakeFiles/SimGearCore.dir/io/sg_file.cxx.o
[ 16%] Building CXX object simgear/CMakeFiles/SimGearCore.dir/io/sg_netBuffer.cxx.o
[ 16%] Building CXX object simgear/CMakeFiles/SimGearCore.dir/io/sg_netChannel.cxx.o
[ 16%] Building CXX object simgear/CMakeFiles/SimGearCore.dir/io/sg_netChat.cxx.o
[ 17%] Building CXX object simgear/CMakeFiles/SimGearCore.dir/io/sg_serial.cxx.o
[ 17%] Building CXX object simgear/CMakeFiles/SimGearCore.dir/io/sg_socket.cxx.o
[ 17%] Building CXX object simgear/CMakeFiles/SimGearCore.dir/io/sg_socket_udp.cxx.o
[ 17%] Building CXX object simgear/CMakeFiles/SimGearCore.dir/io/HTTPClient.cxx.o
[ 18%] Building CXX object simgear/CMakeFiles/SimGearCore.dir/io/HTTPFileRequest.cxx.o
[ 18%] Building CXX object simgear/CMakeFiles/SimGearCore.dir/io/HTTPMemoryRequest.cxx.o
[ 18%] Building CXX object simgear/CMakeFiles/SimGearCore.dir/io/HTTPRequest.cxx.o
[ 18%] Building CXX object simgear/CMakeFiles/SimGearCore.dir/io/HTTPRepository.cxx.o
[ 19%] Building CXX object simgear/CMakeFiles/SimGearCore.dir/io/untar.cxx.o
[ 19%] Building CXX object simgear/CMakeFiles/SimGearCore.dir/io/DNSClient.cxx.o
[ 19%] Building CXX object simgear/CMakeFiles/SimGearCore.dir/magvar/magvar.cxx.o
[ 20%] Building CXX object simgear/CMakeFiles/SimGearCore.dir/magvar/coremag.cxx.o
[ 20%] Building CXX object simgear/CMakeFiles/SimGearCore.dir/math/SGGeodesy.cxx.o
[ 20%] Building CXX object simgear/CMakeFiles/SimGearCore.dir/math/interpolater.cxx.o
[ 20%] Building CXX object simgear/CMakeFiles/SimGearCore.dir/math/leastsqs.cxx.o
[ 21%] Building C object simgear/CMakeFiles/SimGearCore.dir/math/sg_random.c.o
[ 21%] Building CXX object simgear/CMakeFiles/SimGearCore.dir/misc/CSSBorder.cxx.o
[ 21%] Building CXX object simgear/CMakeFiles/SimGearCore.dir/misc/ResourceManager.cxx.o
[ 21%] Building CXX object simgear/CMakeFiles/SimGearCore.dir/misc/SimpleMarkdown.cxx.o
[ 22%] Building CXX object simgear/CMakeFiles/SimGearCore.dir/misc/SVGpreserveAspectRatio.cxx.o
[ 22%] Building CXX object simgear/CMakeFiles/SimGearCore.dir/misc/argparse.cxx.o
[ 22%] Building CXX object simgear/CMakeFiles/SimGearCore.dir/misc/interpolator.cxx.o
[ 22%] Building CXX object simgear/CMakeFiles/SimGearCore.dir/misc/sg_dir.cxx.o
[ 23%] Building CXX object simgear/CMakeFiles/SimGearCore.dir/misc/sg_path.cxx.o
[ 23%] Building CXX object simgear/CMakeFiles/SimGearCore.dir/misc/sg_hash.cxx.o
[ 23%] Building CXX object simgear/CMakeFiles/SimGearCore.dir/misc/strutils.cxx.o
[ 23%] Building CXX object simgear/CMakeFiles/SimGearCore.dir/misc/tabbed_values.cxx.o
[ 24%] Building CXX object simgear/CMakeFiles/SimGearCore.dir/misc/texcoord.cxx.o
[ 24%] Building C object simgear/CMakeFiles/SimGearCore.dir/nasal/bitslib.c.o
[ 24%] Building C object simgear/CMakeFiles/SimGearCore.dir/nasal/code.c.o
[ 24%] Building C object simgear/CMakeFiles/SimGearCore.dir/nasal/codegen.c.o
[ 25%] Building C object simgear/CMakeFiles/SimGearCore.dir/nasal/gc.c.o
[ 25%] Building C object simgear/CMakeFiles/SimGearCore.dir/nasal/hash.c.o
[ 25%] Building C object simgear/CMakeFiles/SimGearCore.dir/nasal/iolib.c.o
[ 25%] Building C object simgear/CMakeFiles/SimGearCore.dir/nasal/lex.c.o
[ 26%] Building C object simgear/CMakeFiles/SimGearCore.dir/nasal/lib.c.o
[ 26%] Building C object simgear/CMakeFiles/SimGearCore.dir/nasal/mathlib.c.o
[ 26%] Building C object simgear/CMakeFiles/SimGearCore.dir/nasal/misc.c.o
[ 27%] Building C object simgear/CMakeFiles/SimGearCore.dir/nasal/parse.c.o
[ 27%] Building C object simgear/CMakeFiles/SimGearCore.dir/nasal/string.c.o
[ 27%] Building C object simgear/CMakeFiles/SimGearCore.dir/nasal/thread-posix.c.o
[ 27%] Building C object simgear/CMakeFiles/SimGearCore.dir/nasal/thread-win32.c.o
[ 28%] Building C object simgear/CMakeFiles/SimGearCore.dir/nasal/threadlib.c.o
[ 28%] Building C object simgear/CMakeFiles/SimGearCore.dir/nasal/utf8lib.c.o
[ 28%] Building C object simgear/CMakeFiles/SimGearCore.dir/nasal/vector.c.o
[ 28%] Building CXX object simgear/CMakeFiles/SimGearCore.dir/nasal/cppbind/Ghost.cxx.o
[ 28%] Building CXX object simgear/CMakeFiles/SimGearCore.dir/nasal/cppbind/NasalHash.cxx.o
[ 29%] Building CXX object simgear/CMakeFiles/SimGearCore.dir/nasal/cppbind/NasalContext.cxx.o
[ 29%] Building CXX object simgear/CMakeFiles/SimGearCore.dir/nasal/cppbind/NasalString.cxx.o
[ 29%] Building CXX object simgear/CMakeFiles/SimGearCore.dir/nasal/cppbind/NasalObject.cxx.o
[ 30%] Building CXX object simgear/CMakeFiles/SimGearCore.dir/nasal/cppbind/detail/from_nasal_helper.cxx.o
[ 30%] Building CXX object simgear/CMakeFiles/SimGearCore.dir/nasal/cppbind/detail/to_nasal_helper.cxx.o
[ 30%] Building CXX object simgear/CMakeFiles/SimGearCore.dir/props/AtomicChangeListener.cxx.o
[ 30%] Building CXX object simgear/CMakeFiles/SimGearCore.dir/props/condition.cxx.o
[ 31%] Building CXX object simgear/CMakeFiles/SimGearCore.dir/props/easing_functions.cxx.o
[ 31%] Building CXX object simgear/CMakeFiles/SimGearCore.dir/props/PropertyBasedElement.cxx.o
[ 31%] Building CXX object simgear/CMakeFiles/SimGearCore.dir/props/PropertyBasedMgr.cxx.o
[ 31%] Building CXX object simgear/CMakeFiles/SimGearCore.dir/props/PropertyInterpolationMgr.cxx.o
[ 32%] Building CXX object simgear/CMakeFiles/SimGearCore.dir/props/PropertyInterpolator.cxx.o
[ 32%] Building CXX object simgear/CMakeFiles/SimGearCore.dir/props/propertyObject.cxx.o
[ 32%] Building CXX object simgear/CMakeFiles/SimGearCore.dir/props/props.cxx.o
[ 32%] Building CXX object simgear/CMakeFiles/SimGearCore.dir/props/props_io.cxx.o
[ 33%] Building CXX object simgear/CMakeFiles/SimGearCore.dir/serial/serial.cxx.o
[ 33%] Building CXX object simgear/CMakeFiles/SimGearCore.dir/structure/SGAtomic.cxx.o
[ 33%] Building CXX object simgear/CMakeFiles/SimGearCore.dir/structure/SGBinding.cxx.o
[ 34%] Building CXX object simgear/CMakeFiles/SimGearCore.dir/structure/SGExpression.cxx.o
[ 34%] Building CXX object simgear/CMakeFiles/SimGearCore.dir/structure/SGSmplhist.cxx.o
[ 34%] Building CXX object simgear/CMakeFiles/SimGearCore.dir/structure/SGSmplstat.cxx.o
[ 34%] Building CXX object simgear/CMakeFiles/SimGearCore.dir/structure/SGPerfMon.cxx.o
[ 35%] Building CXX object simgear/CMakeFiles/SimGearCore.dir/structure/StringTable.cxx.o
[ 35%] Building CXX object simgear/CMakeFiles/SimGearCore.dir/structure/commands.cxx.o
[ 35%] Building CXX object simgear/CMakeFiles/SimGearCore.dir/structure/event_mgr.cxx.o
[ 35%] Building CXX object simgear/CMakeFiles/SimGearCore.dir/structure/exception.cxx.o
[ 36%] Building CXX object simgear/CMakeFiles/SimGearCore.dir/structure/subsystem_mgr.cxx.o
[ 36%] Building CXX object simgear/CMakeFiles/SimGearCore.dir/structure/StateMachine.cxx.o
[ 36%] Building CXX object simgear/CMakeFiles/SimGearCore.dir/threads/SGThread.cxx.o
[ 36%] Building CXX object simgear/CMakeFiles/SimGearCore.dir/timing/lowleveltime.cxx.o
[ 37%] Building CXX object simgear/CMakeFiles/SimGearCore.dir/timing/sg_time.cxx.o
[ 37%] Building CXX object simgear/CMakeFiles/SimGearCore.dir/timing/timestamp.cxx.o
[ 37%] Building CXX object simgear/CMakeFiles/SimGearCore.dir/timing/timezone.cxx.o
[ 37%] Building CXX object simgear/CMakeFiles/SimGearCore.dir/xml/easyxml.cxx.o
[ 38%] Building CXX object simgear/CMakeFiles/SimGearCore.dir/package/Catalog.cxx.o
[ 38%] Building CXX object simgear/CMakeFiles/SimGearCore.dir/package/Package.cxx.o
[ 38%] Building CXX object simgear/CMakeFiles/SimGearCore.dir/package/Install.cxx.o
[ 38%] Building CXX object simgear/CMakeFiles/SimGearCore.dir/package/Root.cxx.o
[ 39%] Building CXX object simgear/CMakeFiles/SimGearCore.dir/package/Delegate.cxx.o
[ 39%] Building C object simgear/CMakeFiles/SimGearCore.dir/package/md5.c.o
[ 39%] Building C object simgear/CMakeFiles/SimGearCore.dir/package/ioapi.c.o
[ 40%] Building C object simgear/CMakeFiles/SimGearCore.dir/package/ioapi_mem.c.o
[ 40%] Building C object simgear/CMakeFiles/SimGearCore.dir/package/unzip.c.o
[ 40%] Building CXX object simgear/CMakeFiles/SimGearCore.dir/scene/tsync/terrasync.cxx.o
[ 40%] Building C object simgear/CMakeFiles/SimGearCore.dir/__/3rdparty/expat/hashtable.c.o
[ 41%] Building C object simgear/CMakeFiles/SimGearCore.dir/__/3rdparty/expat/xmlparse.c.o
[ 41%] Building C object simgear/CMakeFiles/SimGearCore.dir/__/3rdparty/expat/xmlrole.c.o
[ 41%] Building C object simgear/CMakeFiles/SimGearCore.dir/__/3rdparty/expat/xmltok.c.o
/home/chris/fg2019_2/simgear/simgear/structure/subsystem_mgr.cxx:1435:10: warning: ‘void {anonymous}::registerSubsystemCommands()’ defined but not used [-Wunused-function]
     void registerSubsystemCommands()
          ^
[ 41%] Linking CXX static library libSimGearCore.a
[ 41%] Built target SimGearCore
Scanning dependencies of target test_magvar
Scanning dependencies of target bvhtest
[ 41%] Building CXX object simgear/magvar/CMakeFiles/test_magvar.dir/testmagvar.cxx.o
[ 41%] Building CXX object simgear/bvh/CMakeFiles/bvhtest.dir/bvhtest.cxx.o
Scanning dependencies of target SimGearScene
[ 42%] Building C object simgear/CMakeFiles/SimGearScene.dir/canvas/ShivaVG/src/shImage.c.o
[ 42%] Building C object simgear/CMakeFiles/SimGearScene.dir/canvas/ShivaVG/src/shContext.c.o
[ 42%] Building C object simgear/CMakeFiles/SimGearScene.dir/canvas/ShivaVG/src/shParams.c.o
[ 42%] Building C object simgear/CMakeFiles/SimGearScene.dir/canvas/ShivaVG/src/shExtensions.c.o
[ 43%] Building C object simgear/CMakeFiles/SimGearScene.dir/canvas/ShivaVG/src/shArrays.c.o
[ 44%] Building C object simgear/CMakeFiles/SimGearScene.dir/canvas/ShivaVG/src/shPipeline.c.o
[ 44%] Building C object simgear/CMakeFiles/SimGearScene.dir/canvas/ShivaVG/src/shPaint.c.o
[ 44%] Building C object simgear/CMakeFiles/SimGearScene.dir/canvas/ShivaVG/src/shGeometry.c.o
[ 44%] Building C object simgear/CMakeFiles/SimGearScene.dir/canvas/ShivaVG/src/shPath.c.o
[ 44%] Building C object simgear/CMakeFiles/SimGearScene.dir/canvas/ShivaVG/src/shVectors.c.o
[ 45%] Linking CXX executable test_magvar
[ 45%] Built target test_magvar
[ 45%] Building C object simgear/CMakeFiles/SimGearScene.dir/canvas/ShivaVG/src/shVgu.c.o
[ 45%] Building CXX object simgear/CMakeFiles/SimGearScene.dir/canvas/elements/CanvasElement.cxx.o
[ 46%] Building CXX object simgear/CMakeFiles/SimGearScene.dir/canvas/elements/CanvasGroup.cxx.o
[ 46%] Building CXX object simgear/CMakeFiles/SimGearScene.dir/canvas/elements/CanvasImage.cxx.o
[ 46%] Building CXX object simgear/CMakeFiles/SimGearScene.dir/canvas/elements/CanvasMap.cxx.o
[ 46%] Building CXX object simgear/CMakeFiles/SimGearScene.dir/canvas/elements/CanvasPath.cxx.o
[ 47%] Building CXX object simgear/CMakeFiles/SimGearScene.dir/canvas/elements/CanvasText.cxx.o
[ 47%] Building CXX object simgear/CMakeFiles/SimGearScene.dir/canvas/events/CustomEvent.cxx.o
[ 47%] Building CXX object simgear/CMakeFiles/SimGearScene.dir/canvas/events/DeviceEvent.cxx.o
[ 48%] Building CXX object simgear/CMakeFiles/SimGearScene.dir/canvas/events/KeyboardEvent.cxx.o
[ 48%] Building CXX object simgear/CMakeFiles/SimGearScene.dir/canvas/events/MouseEvent.cxx.o
[ 48%] Building CXX object simgear/CMakeFiles/SimGearScene.dir/canvas/layout/BoxLayout.cxx.o
[ 49%] Linking CXX executable bvhtest
[ 49%] Built target bvhtest
[ 49%] Building CXX object simgear/CMakeFiles/SimGearScene.dir/canvas/layout/Layout.cxx.o
/home/chris/fg2019_2/simgear/simgear/canvas/elements/CanvasText.cxx: In member function ‘osg::Vec2 simgear::canvas::TextLine::cursorPos(size_t) const’:
/home/chris/fg2019_2/simgear/simgear/canvas/elements/CanvasText.cxx:175:34: warning: unused variable ‘coords’ [-Wunused-variable]
       GlyphQuads::Coords2 const& coords = _quads->_coords;
                                  ^
/home/chris/fg2019_2/simgear/simgear/canvas/elements/CanvasText.cxx: In member function ‘osg::Vec2 simgear::canvas::TextLine::nearestCursor(float) const’:
/home/chris/fg2019_2/simgear/simgear/canvas/elements/CanvasText.cxx:214:31: warning: unused variable ‘glyphs’ [-Wunused-variable]
     GlyphQuads::Glyphs const& glyphs = _quads->_glyphs;
                               ^
/home/chris/fg2019_2/simgear/simgear/canvas/elements/CanvasText.cxx:216:32: warning: unused variable ‘coords’ [-Wunused-variable]
     GlyphQuads::Coords2 const& coords = _quads->_coords;
                                ^
[ 50%] Building CXX object simgear/CMakeFiles/SimGearScene.dir/canvas/layout/LayoutItem.cxx.o
[ 50%] Building CXX object simgear/CMakeFiles/SimGearScene.dir/canvas/layout/NasalWidget.cxx.o
[ 50%] Building CXX object simgear/CMakeFiles/SimGearScene.dir/canvas/layout/SpacerItem.cxx.o
/home/chris/fg2019_2/simgear/simgear/canvas/elements/CanvasText.cxx:244:3: warning: control reaches end of non-void function [-Wreturn-type]
   }
   ^
[ 50%] Building CXX object simgear/CMakeFiles/SimGearScene.dir/canvas/Canvas.cxx.o
[ 51%] Building CXX object simgear/CMakeFiles/SimGearScene.dir/canvas/CanvasEvent.cxx.o
[ 51%] Building CXX object simgear/CMakeFiles/SimGearScene.dir/canvas/CanvasEventManager.cxx.o
[ 51%] Building CXX object simgear/CMakeFiles/SimGearScene.dir/canvas/CanvasEventVisitor.cxx.o
[ 51%] Building CXX object simgear/CMakeFiles/SimGearScene.dir/canvas/CanvasMgr.cxx.o
[ 52%] Building CXX object simgear/CMakeFiles/SimGearScene.dir/canvas/CanvasObjectPlacement.cxx.o
[ 52%] Building CXX object simgear/CMakeFiles/SimGearScene.dir/canvas/CanvasPlacement.cxx.o
[ 52%] Building CXX object simgear/CMakeFiles/SimGearScene.dir/canvas/CanvasWindow.cxx.o
[ 52%] Building CXX object simgear/CMakeFiles/SimGearScene.dir/canvas/ODGauge.cxx.o
[ 53%] Building CXX object simgear/CMakeFiles/SimGearScene.dir/canvas/VGInitOperation.cxx.o
[ 53%] Building CXX object simgear/CMakeFiles/SimGearScene.dir/environment/metar.cxx.o
[ 53%] Building CXX object simgear/CMakeFiles/SimGearScene.dir/environment/precipitation.cxx.o
[ 53%] Building CXX object simgear/CMakeFiles/SimGearScene.dir/screen/extensions.cxx.o
[ 54%] Building CXX object simgear/CMakeFiles/SimGearScene.dir/screen/screen-dump.cxx.o
[ 54%] Building CXX object simgear/CMakeFiles/SimGearScene.dir/screen/tr.cxx.o
[ 54%] Building CXX object simgear/CMakeFiles/SimGearScene.dir/scene/material/Effect.cxx.o
[ 54%] Building CXX object simgear/CMakeFiles/SimGearScene.dir/scene/material/EffectBuilder.cxx.o
[ 55%] Building CXX object simgear/CMakeFiles/SimGearScene.dir/scene/material/EffectCullVisitor.cxx.o
[ 55%] Building CXX object simgear/CMakeFiles/SimGearScene.dir/scene/material/EffectGeode.cxx.o
[ 55%] Building CXX object simgear/CMakeFiles/SimGearScene.dir/scene/material/Pass.cxx.o
[ 56%] Building CXX object simgear/CMakeFiles/SimGearScene.dir/scene/material/Technique.cxx.o
[ 56%] Building CXX object simgear/CMakeFiles/SimGearScene.dir/scene/material/TextureBuilder.cxx.o
[ 56%] Building CXX object simgear/CMakeFiles/SimGearScene.dir/scene/material/makeEffect.cxx.o
[ 56%] Building CXX object simgear/CMakeFiles/SimGearScene.dir/scene/material/mat.cxx.o
[ 57%] Building CXX object simgear/CMakeFiles/SimGearScene.dir/scene/material/matlib.cxx.o
[ 57%] Building CXX object simgear/CMakeFiles/SimGearScene.dir/scene/material/matmodel.cxx.o
[ 57%] Building CXX object simgear/CMakeFiles/SimGearScene.dir/scene/material/mipmap.cxx.o
[ 57%] Building CXX object simgear/CMakeFiles/SimGearScene.dir/scene/material/parseBlendFunc.cxx.o
[ 58%] Building CXX object simgear/CMakeFiles/SimGearScene.dir/scene/model/BVHPageNodeOSG.cxx.o
[ 58%] Building CXX object simgear/CMakeFiles/SimGearScene.dir/scene/model/CheckSceneryVisitor.cxx.o
[ 58%] Building CXX object simgear/CMakeFiles/SimGearScene.dir/scene/model/ConditionNode.cxx.o
[ 58%] Building CXX object simgear/CMakeFiles/SimGearScene.dir/scene/model/ModelRegistry.cxx.o
[ 59%] Building CXX object simgear/CMakeFiles/SimGearScene.dir/scene/model/PrimitiveCollector.cxx.o
[ 59%] Building CXX object simgear/CMakeFiles/SimGearScene.dir/scene/model/SGClipGroup.cxx.o
[ 59%] Building CXX object simgear/CMakeFiles/SimGearScene.dir/scene/model/SGInteractionAnimation.cxx.o
[ 59%] Building CXX object simgear/CMakeFiles/SimGearScene.dir/scene/model/SGLightAnimation.cxx.o
[ 60%] Building CXX object simgear/CMakeFiles/SimGearScene.dir/scene/model/SGPickAnimation.cxx.o
[ 60%] Building CXX object simgear/CMakeFiles/SimGearScene.dir/scene/model/SGMaterialAnimation.cxx.o
[ 60%] Building CXX object simgear/CMakeFiles/SimGearScene.dir/scene/model/SGOffsetTransform.cxx.o
[ 60%] Building CXX object simgear/CMakeFiles/SimGearScene.dir/scene/model/SGReaderWriterXML.cxx.o
[ 61%] Building CXX object simgear/CMakeFiles/SimGearScene.dir/scene/model/SGRotateTransform.cxx.o
[ 61%] Building CXX object simgear/CMakeFiles/SimGearScene.dir/scene/model/SGScaleTransform.cxx.o
[ 61%] Building CXX object simgear/CMakeFiles/SimGearScene.dir/scene/model/SGText.cxx.o
[ 62%] Building CXX object simgear/CMakeFiles/SimGearScene.dir/scene/model/SGTrackToAnimation.cxx.o
[ 62%] Building CXX object simgear/CMakeFiles/SimGearScene.dir/scene/model/SGTranslateTransform.cxx.o
[ 62%] Building CXX object simgear/CMakeFiles/SimGearScene.dir/scene/model/animation.cxx.o
[ 62%] Building CXX object simgear/CMakeFiles/SimGearScene.dir/scene/model/model.cxx.o
[ 63%] Building CXX object simgear/CMakeFiles/SimGearScene.dir/scene/model/modellib.cxx.o
[ 63%] Building CXX object simgear/CMakeFiles/SimGearScene.dir/scene/model/particles.cxx.o
[ 63%] Building CXX object simgear/CMakeFiles/SimGearScene.dir/scene/model/persparam.cxx.o
[ 63%] Building CXX object simgear/CMakeFiles/SimGearScene.dir/scene/model/placement.cxx.o
[ 64%] Building CXX object simgear/CMakeFiles/SimGearScene.dir/scene/model/shadanim.cxx.o
[ 64%] Building CXX object simgear/CMakeFiles/SimGearScene.dir/scene/sky/CloudShaderGeometry.cxx.o
[ 64%] Building CXX object simgear/CMakeFiles/SimGearScene.dir/scene/sky/cloud.cxx.o
[ 64%] Building CXX object simgear/CMakeFiles/SimGearScene.dir/scene/sky/cloudfield.cxx.o
[ 65%] Building CXX object simgear/CMakeFiles/SimGearScene.dir/scene/sky/dome.cxx.o
[ 65%] Building CXX object simgear/CMakeFiles/SimGearScene.dir/scene/sky/moon.cxx.o
[ 65%] Building CXX object simgear/CMakeFiles/SimGearScene.dir/scene/sky/newcloud.cxx.o
[ 65%] Building CXX object simgear/CMakeFiles/SimGearScene.dir/scene/sky/oursun.cxx.o
[ 66%] Building CXX object simgear/CMakeFiles/SimGearScene.dir/scene/sky/sky.cxx.o
[ 66%] Building CXX object simgear/CMakeFiles/SimGearScene.dir/scene/sky/sphere.cxx.o
[ 66%] Building CXX object simgear/CMakeFiles/SimGearScene.dir/scene/sky/stars.cxx.o
[ 66%] Building CXX object simgear/CMakeFiles/SimGearScene.dir/scene/tgdb/GroundLightManager.cxx.o
[ 67%] Building CXX object simgear/CMakeFiles/SimGearScene.dir/scene/tgdb/ReaderWriterSPT.cxx.o
[ 67%] Building CXX object simgear/CMakeFiles/SimGearScene.dir/scene/tgdb/ReaderWriterSTG.cxx.o
[ 67%] Building CXX object simgear/CMakeFiles/SimGearScene.dir/scene/tgdb/SGBuildingBin.cxx.o
[ 67%] Building CXX object simgear/CMakeFiles/SimGearScene.dir/scene/tgdb/SGOceanTile.cxx.o
[ 68%] Building CXX object simgear/CMakeFiles/SimGearScene.dir/scene/tgdb/SGReaderWriterBTG.cxx.o
[ 68%] Building CXX object simgear/CMakeFiles/SimGearScene.dir/scene/tgdb/SGVasiDrawable.cxx.o
[ 68%] Building CXX object simgear/CMakeFiles/SimGearScene.dir/scene/tgdb/ShaderGeometry.cxx.o
[ 69%] Building CXX object simgear/CMakeFiles/SimGearScene.dir/scene/tgdb/TreeBin.cxx.o
[ 69%] Building CXX object simgear/CMakeFiles/SimGearScene.dir/scene/tgdb/apt_signs.cxx.o
[ 69%] Building CXX object simgear/CMakeFiles/SimGearScene.dir/scene/tgdb/obj.cxx.o
[ 69%] Building CXX object simgear/CMakeFiles/SimGearScene.dir/scene/tgdb/pt_lights.cxx.o
[ 70%] Building CXX object simgear/CMakeFiles/SimGearScene.dir/scene/tgdb/userdata.cxx.o
[ 70%] Building CXX object simgear/CMakeFiles/SimGearScene.dir/scene/util/ColorInterpolator.cxx.o
[ 70%] Building CXX object simgear/CMakeFiles/SimGearScene.dir/scene/util/CopyOp.cxx.o
[ 70%] Building CXX object simgear/CMakeFiles/SimGearScene.dir/scene/util/DeletionManager.cxx.o
[ 71%] Building CXX object simgear/CMakeFiles/SimGearScene.dir/scene/util/NodeAndDrawableVisitor.cxx.o
[ 71%] Building CXX object simgear/CMakeFiles/SimGearScene.dir/scene/util/Noise.cxx.o
[ 71%] Building CXX object simgear/CMakeFiles/SimGearScene.dir/scene/util/OptionsReadFileCallback.cxx.o
[ 71%] Building CXX object simgear/CMakeFiles/SimGearScene.dir/scene/util/OsgDebug.cxx.o
[ 72%] Building CXX object simgear/CMakeFiles/SimGearScene.dir/scene/util/parse_color.cxx.o
[ 72%] Building CXX object simgear/CMakeFiles/SimGearScene.dir/scene/util/PrimitiveUtils.cxx.o
[ 72%] Building CXX object simgear/CMakeFiles/SimGearScene.dir/scene/util/QuadTreeBuilder.cxx.o
[ 72%] Building CXX object simgear/CMakeFiles/SimGearScene.dir/scene/util/SGEnlargeBoundingBox.cxx.o
[ 73%] Building CXX object simgear/CMakeFiles/SimGearScene.dir/scene/util/SGImageUtils.cxx.o
[ 73%] Building CXX object simgear/CMakeFiles/SimGearScene.dir/scene/util/SGReaderWriterOptions.cxx.o
[ 73%] Building CXX object simgear/CMakeFiles/SimGearScene.dir/scene/util/SGSceneFeatures.cxx.o
[ 73%] Building CXX object simgear/CMakeFiles/SimGearScene.dir/scene/util/SGSceneUserData.cxx.o
[ 74%] Building CXX object simgear/CMakeFiles/SimGearScene.dir/scene/util/SGStateAttributeVisitor.cxx.o
[ 74%] Building CXX object simgear/CMakeFiles/SimGearScene.dir/scene/util/SGTextureStateAttributeVisitor.cxx.o
[ 74%] Building CXX object simgear/CMakeFiles/SimGearScene.dir/scene/util/SplicingVisitor.cxx.o
[ 75%] Building CXX object simgear/CMakeFiles/SimGearScene.dir/scene/util/UpdateOnceCallback.cxx.o
[ 75%] Building CXX object simgear/CMakeFiles/SimGearScene.dir/scene/util/StateAttributeFactory.cxx.o
[ 75%] Building CXX object simgear/CMakeFiles/SimGearScene.dir/scene/util/project.cxx.o
[ 75%] Building CXX object simgear/CMakeFiles/SimGearScene.dir/scene/viewer/ClusteredForward.cxx.o
[ 76%] Building CXX object simgear/CMakeFiles/SimGearScene.dir/scene/viewer/Compositor.cxx.o
/home/chris/fg2019_2/simgear/simgear/scene/util/SGImageUtils.cxx: In static member function ‘static void simgear::{anonymous}::ColorWriter<32818, unsigned char>::write(const simgear::ImageUtils::PixelWriter*, const osg::Vec4f&, int, int, int, int)’:
/home/chris/fg2019_2/simgear/simgear/scene/util/SGImageUtils.cxx:1815:22: warning: unused variable ‘ptr’ [-Wunused-variable]
             GLubyte* ptr = (GLubyte*)iw->data(s, t, r, m);
                      ^
[ 76%] Building CXX object simgear/CMakeFiles/SimGearScene.dir/scene/viewer/CompositorBuffer.cxx.o
[ 76%] Building CXX object simgear/CMakeFiles/SimGearScene.dir/scene/viewer/CompositorPass.cxx.o
[ 76%] Building CXX object simgear/CMakeFiles/SimGearScene.dir/scene/viewer/CompositorUtil.cxx.o
[ 77%] Building CXX object simgear/CMakeFiles/SimGearScene.dir/sound/sample.cxx.o
[ 77%] Building CXX object simgear/CMakeFiles/SimGearScene.dir/sound/sample_group.cxx.o
[ 77%] Building CXX object simgear/CMakeFiles/SimGearScene.dir/sound/xmlsound.cxx.o
[ 77%] Building CXX object simgear/CMakeFiles/SimGearScene.dir/sound/filters.cxx.o
[ 78%] Building CXX object simgear/CMakeFiles/SimGearScene.dir/sound/soundmgr_openal.cxx.o
[ 78%] Building CXX object simgear/CMakeFiles/SimGearScene.dir/sound/readwav.cxx.o
/home/chris/fg2019_2/simgear/simgear/scene/viewer/Compositor.cxx: In member function ‘void simgear::compositor::Compositor::resized()’:
/home/chris/fg2019_2/simgear/simgear/scene/viewer/Compositor.cxx:198:17: error: ‘class osg::Camera’ has no member named ‘resize’
         camera->resize(pass->viewport_width_scale  * _viewport->width(),
                 ^
simgear/CMakeFiles/SimGearScene.dir/build.make:3014 : la recette pour la cible « simgear/CMakeFiles/SimGearScene.dir/scene/viewer/Compositor.cxx.o » a échouée
make[2]: *** [simgear/CMakeFiles/SimGearScene.dir/scene/viewer/Compositor.cxx.o] Erreur 1
make[2]: *** Attente des tâches non terminées....
CMakeFiles/Makefile2:1180 : la recette pour la cible « simgear/CMakeFiles/SimGearScene.dir/all » a échouée
make[1]: *** [simgear/CMakeFiles/SimGearScene.dir/all] Erreur 2
Makefile:160 : la recette pour la cible « all » a échouée
make: *** [all] Erreur 2
INSTALL simgear
[ 41%] Built target SimGearCore
[ 42%] Building CXX object simgear/CMakeFiles/SimGearScene.dir/scene/viewer/Compositor.cxx.o
/home/chris/fg2019_2/simgear/simgear/scene/viewer/Compositor.cxx: In member function ‘void simgear::compositor::Compositor::resized()’:
/home/chris/fg2019_2/simgear/simgear/scene/viewer/Compositor.cxx:198:17: error: ‘class osg::Camera’ has no member named ‘resize’
         camera->resize(pass->viewport_width_scale  * _viewport->width(),
                 ^
simgear/CMakeFiles/SimGearScene.dir/build.make:3014 : la recette pour la cible « simgear/CMakeFiles/SimGearScene.dir/scene/viewer/Compositor.cxx.o » a échouée
make[2]: *** [simgear/CMakeFiles/SimGearScene.dir/scene/viewer/Compositor.cxx.o] Erreur 1
CMakeFiles/Makefile2:1180 : la recette pour la cible « simgear/CMakeFiles/SimGearScene.dir/all » a échouée
make[1]: *** [simgear/CMakeFiles/SimGearScene.dir/all] Erreur 2
Makefile:160 : la recette pour la cible « all » a échouée
make: *** [all] Erreur 2
***********************************
All optional package alternatives have found a matching package.

FGFS : Pas bon

./download_and_compile.sh FGFS
VERSION=$Id
APT_GET_UPDATE=y
DOWNLOAD_PACKAGES=y
COMPILE=y
RECONFIGURE=y
DOWNLOAD=y
JOPTION= -j12 
OOPTION=
BUILD_TYPE=RelWithDebInfo
***********************************
Considering a package alternative: libcurl4-openssl-dev libcurl4-gnutls-dev
Package alternative matched for libcurl4-openssl-dev
Considering a package alternative: libopenscenegraph-3.4-dev libopenscenegraph-dev libopenscenegraph-[0-9]+\.[0-9]+-dev
Package alternative matched for libopenscenegraph-dev
Considering a package alternative: libpng-dev libpng12-dev libpng16-dev
Package alternative matched for libpng12-dev
Considering an optional package alternative: qml-module-qtquick2
Optional package alternative matched for qml-module-qtquick2
Considering an optional package alternative: qml-module-qtquick-window2
Optional package alternative matched for qml-module-qtquick-window2
Considering an optional package alternative: qml-module-qtquick-dialogs
Optional package alternative matched for qml-module-qtquick-dialogs
Considering an optional package alternative: qtbase5-private-dev
Optional package alternative matched for qtbase5-private-dev
Considering an optional package alternative: qtdeclarative5-private-dev
Optional package alternative matched for qtdeclarative5-private-dev
DIRECTORY= /home/chris/fg2019_2
***********************************
****************************************
************** FLIGHTGEAR **************
****************************************
CMAKE Build type: RelWithDebInfo
-- Setting build type to 'Dev' as none was specified.
-- The C compiler identification is GNU 5.4.0
-- The CXX compiler identification is GNU 5.4.0
-- Check for working C compiler: /usr/bin/cc
-- Check for working C compiler: /usr/bin/cc -- works
-- Detecting C compiler ABI info
-- Detecting C compiler ABI info - done
-- Detecting C compile features
-- Detecting C compile features - done
-- Check for working CXX compiler: /usr/bin/c++
-- Check for working CXX compiler: /usr/bin/c++ -- works
-- Detecting CXX compiler ABI info
-- Detecting CXX compiler ABI info - done
-- Detecting CXX compile features
-- Detecting CXX compile features - done
-- System is: Linux
-- Linux distro is: LinuxMint
-- Web browser launcher command is: xdg-open
-- Using default data directory for base package:  /home/chris/fg2019_2/install/flightgear/lib/FlightGear
-- Looking for pthread.h
-- Looking for pthread.h - found
-- Looking for pthread_create
-- Looking for pthread_create - not found
-- Looking for pthread_create in pthreads
-- Looking for pthread_create in pthreads - not found
-- Looking for pthread_create in pthread
-- Looking for pthread_create in pthread - found
-- Found Threads: TRUE  
-- Looking for XOpenDisplay in /usr/lib/x86_64-linux-gnu/libX11.so;/usr/lib/x86_64-linux-gnu/libXext.so
-- Looking for XOpenDisplay in /usr/lib/x86_64-linux-gnu/libX11.so;/usr/lib/x86_64-linux-gnu/libXext.so - found
-- Looking for gethostbyname
-- Looking for gethostbyname - found
-- Looking for connect
-- Looking for connect - found
-- Looking for remove
-- Looking for remove - found
-- Looking for shmat
-- Looking for shmat - found
-- Looking for IceConnectionNumber in ICE
-- Looking for IceConnectionNumber in ICE - found
-- Found X11: /usr/lib/x86_64-linux-gnu/libX11.so
-- libudev stable: 1
-- Found UDev: /usr/lib/x86_64-linux-gnu/libudev.so
--    include: /usr/include
-- event-based input enabled. Using /usr/lib/x86_64-linux-gnu/libudev.so
-- Boost version: 1.58.0
-- Found OpenGL: /usr/lib/x86_64-linux-gnu/libGL.so  
-- Found osgText: /usr/lib/x86_64-linux-gnu/libosgText.so  
-- Found osgSim: /usr/lib/x86_64-linux-gnu/libosgSim.so  
-- Found osgDB: /usr/lib/x86_64-linux-gnu/libosgDB.so  
-- Found osgParticle: /usr/lib/x86_64-linux-gnu/libosgParticle.so  
-- Found osgFX: /usr/lib/x86_64-linux-gnu/libosgFX.so  
-- Found osgUtil: /usr/lib/x86_64-linux-gnu/libosgUtil.so  
-- Found osgViewer: /usr/lib/x86_64-linux-gnu/libosgViewer.so  
-- Found osgGA: /usr/lib/x86_64-linux-gnu/libosgGA.so  
-- Found osg: /usr/lib/x86_64-linux-gnu/libosg.so  
-- Found OpenThreads: /usr/lib/x86_64-linux-gnu/libOpenThreads.so  
-- Found OpenSceneGraph: /usr/lib/x86_64-linux-gnu/libosgText.so;/usr/lib/x86_64-linux-gnu/libosgSim.so;/usr/lib/x86_64-linux-gnu/libosgDB.so;/usr/lib/x86_64-linux-gnu/libosgParticle.so;/usr/lib/x86_64-linux-gnu/libosgFX.so;/usr/lib/x86_64-linux-gnu/libosgUtil.so;/usr/lib/x86_64-linux-gnu/libosgViewer.so;/usr/lib/x86_64-linux-gnu/libosgGA.so;/usr/lib/x86_64-linux-gnu/libosg.so;/usr/lib/x86_64-linux-gnu/libOpenThreads.so (found suitable version "3.2.1", minimum required is "3.2.0") 
-- Found PkgConfig: /usr/bin/pkg-config (found version "0.29.1") 
-- Checking for module 'dbus-1'
--   Found dbus-1, version 1.10.6
-- Using DBus
-- Qt launcher enabled, checking for Qt >= 5.4 / qmake
-- Will enable Qt launcher GUI
--   Qt5Widgets version: 5.5.1
--   Qt5Widgets include dir: /usr/include/x86_64-linux-gnu/qt5/;/usr/include/x86_64-linux-gnu/qt5/QtWidgets;/usr/include/x86_64-linux-gnu/qt5/QtGui;/usr/include/x86_64-linux-gnu/qt5/QtCore;/usr/lib/x86_64-linux-gnu/qt5//mkspecs/linux-g++-64;/usr/include
-- Couldn't find translations data, will not include translated string in the executable
CMake Warning at /usr/lib/x86_64-linux-gnu/cmake/Qt5/Qt5Config.cmake:26 (find_package):
  Could not find a package configuration file provided by "Qt5LinguistTools"
  with any of the following names:

    Qt5LinguistToolsConfig.cmake
    qt5linguisttools-config.cmake

  Add the installation prefix of "Qt5LinguistTools" to CMAKE_PREFIX_PATH or
  set "Qt5LinguistTools_DIR" to a directory containing one of the above
  files.  If "Qt5LinguistTools" provides a separate development package or
  SDK, be sure it has been installed.
Call Stack (most recent call first):
  CMakeModules/Translations.cmake:18 (find_package)
  CMakeLists.txt:333 (include)


CMake Warning at CMakeModules/Translations.cmake:18 (find_package):
  Found package configuration file:

    /usr/lib/x86_64-linux-gnu/cmake/Qt5/Qt5Config.cmake

  but it set Qt5_FOUND to FALSE so package "Qt5" is considered to be NOT
  FOUND.  Reason given by package:

  Failed to find Qt5 component "LinguistTools" config file at
  "/usr/lib/x86_64-linux-gnu/cmake/Qt5LinguistTools/Qt5LinguistToolsConfig.cmake"


  

Call Stack (most recent call first):
  CMakeLists.txt:333 (include)


-- /home/chris/fg2019_2/install/plib/include
-- Found PLIB: optimized;/home/chris/fg2019_2/install/plib/lib/libplibpuaux.a;debug;/home/chris/fg2019_2/install/plib/lib/libplibpuaux.a;optimized;/home/chris/fg2019_2/install/plib/lib/libplibpu.a;debug;/home/chris/fg2019_2/install/plib/lib/libplibpu.a;optimized;/home/chris/fg2019_2/install/plib/lib/libplibfnt.a;debug;/home/chris/fg2019_2/install/plib/lib/libplibfnt.a;optimized;/home/chris/fg2019_2/install/plib/lib/libplibsg.a;debug;/home/chris/fg2019_2/install/plib/lib/libplibsg.a;optimized;/home/chris/fg2019_2/install/plib/lib/libplibul.a;debug;/home/chris/fg2019_2/install/plib/lib/libplibul.a  
-- Min Simgear version is 2019.2.0
CMake Error at CMakeLists.txt:356 (find_package):
  Could not find a package configuration file provided by "SimGear"
  (requested version 2019.2.0) with any of the following names:

    SimGearConfig.cmake
    simgear-config.cmake

  Add the installation prefix of "SimGear" to CMAKE_PREFIX_PATH or set
  "SimGear_DIR" to a directory containing one of the above files.  If
  "SimGear" provides a separate development package or SDK, be sure it has
  been installed.


-- Configuring incomplete, errors occurred!
See also "/home/chris/fg2019_2/build/flightgear/CMakeFiles/CMakeOutput.log".
See also "/home/chris/fg2019_2/build/flightgear/CMakeFiles/CMakeError.log".
MAKE flightgear
make: *** Pas de cible spécifiée et aucun makefile n'a été trouvé. Arrêt.
INSTALL flightgear
make: *** Aucune règle pour fabriquer la cible « install ». Arrêt.
***********************************
All optional package alternatives have found a matching package.

Le CMakeError.log :

Determining if the pthread_create exist failed with the following output:
Change Dir: /home/chris/fg2019_2/build/flightgear/CMakeFiles/CMakeTmp

Run Build Command:"/usr/bin/make" "cmTC_3116e/fast"
/usr/bin/make -f CMakeFiles/cmTC_3116e.dir/build.make CMakeFiles/cmTC_3116e.dir/build
make[1] : on entre dans le répertoire « /home/chris/fg2019_2/build/flightgear/CMakeFiles/CMakeTmp »
Building C object CMakeFiles/cmTC_3116e.dir/CheckSymbolExists.c.o
/usr/bin/cc     -o CMakeFiles/cmTC_3116e.dir/CheckSymbolExists.c.o   -c /home/chris/fg2019_2/build/flightgear/CMakeFiles/CMakeTmp/CheckSymbolExists.c
Linking C executable cmTC_3116e
/usr/bin/cmake -E cmake_link_script CMakeFiles/cmTC_3116e.dir/link.txt --verbose=1
/usr/bin/cc       CMakeFiles/cmTC_3116e.dir/CheckSymbolExists.c.o  -o cmTC_3116e -rdynamic 
CMakeFiles/cmTC_3116e.dir/CheckSymbolExists.c.o : Dans la fonction « main » :
CheckSymbolExists.c:(.text+0x16) : référence indéfinie vers « pthread_create »
collect2: error: ld returned 1 exit status
CMakeFiles/cmTC_3116e.dir/build.make:97 : la recette pour la cible « cmTC_3116e » a échouée
make[1]: *** [cmTC_3116e] Erreur 1
make[1] : on quitte le répertoire « /home/chris/fg2019_2/build/flightgear/CMakeFiles/CMakeTmp »
Makefile:126 : la recette pour la cible « cmTC_3116e/fast » a échouée
make: *** [cmTC_3116e/fast] Erreur 2

File /home/chris/fg2019_2/build/flightgear/CMakeFiles/CMakeTmp/CheckSymbolExists.c:
/* */
#include <pthread.h>

int main(int argc, char** argv)
{
  (void)argv;
#ifndef pthread_create
  return ((int*)(&pthread_create))[argc];
#else
  (void)argc;
  return 0;
#endif
}

Determining if the function pthread_create exists in the pthreads failed with the following output:
Change Dir: /home/chris/fg2019_2/build/flightgear/CMakeFiles/CMakeTmp

Run Build Command:"/usr/bin/make" "cmTC_d251c/fast"
/usr/bin/make -f CMakeFiles/cmTC_d251c.dir/build.make CMakeFiles/cmTC_d251c.dir/build
make[1] : on entre dans le répertoire « /home/chris/fg2019_2/build/flightgear/CMakeFiles/CMakeTmp »
Building C object CMakeFiles/cmTC_d251c.dir/CheckFunctionExists.c.o
/usr/bin/cc    -DCHECK_FUNCTION_EXISTS=pthread_create   -o CMakeFiles/cmTC_d251c.dir/CheckFunctionExists.c.o   -c /usr/share/cmake-3.5/Modules/CheckFunctionExists.c
Linking C executable cmTC_d251c
/usr/bin/cmake -E cmake_link_script CMakeFiles/cmTC_d251c.dir/link.txt --verbose=1
/usr/bin/cc   -DCHECK_FUNCTION_EXISTS=pthread_create    CMakeFiles/cmTC_d251c.dir/CheckFunctionExists.c.o  -o cmTC_d251c -rdynamic -lpthreads 
/usr/bin/ld : ne peut trouver -lpthreads
collect2: error: ld returned 1 exit status
CMakeFiles/cmTC_d251c.dir/build.make:97 : la recette pour la cible « cmTC_d251c » a échouée
make[1]: *** [cmTC_d251c] Erreur 1
make[1] : on quitte le répertoire « /home/chris/fg2019_2/build/flightgear/CMakeFiles/CMakeTmp »
Makefile:126 : la recette pour la cible « cmTC_d251c/fast » a échouée
make: *** [cmTC_d251c/fast] Erreur 2

Dernière modification par Clm76 (20/03/2019 9:09:23)


Fg 2019.2.0 - LinuxMint 19.1 Tessa - CM Asus P8H67 MLE - CPU i3 2100T - 12 Go Ram - Nvidia Geforce GTX 770 - Driver Nvidia 430.26
+ Hp notebook-15-da0118nf -  CPU i3-7020u - Ram 4Go - Intel Graphics 620.

Hors ligne

#12 20/03/2019 9:29:57

ctesc356
Membre
Inscription : 18/05/2010
Messages : 2 745

Re : Erreur compilation FGFS

Bonjour,
si simgear pas bon, fgfs ne peut pas être bon wink

Pour simgear il semblerait bien que ça vienne du build par cmake?
Alors essaie en compilant cmake.
Bizarre, ici ça passe dans un dossier vierge.

ps: c'est dans le cmake log de sg qu'il faut chercher le ver
pour fg c'est clair, le défaut est notifié dans le log d&c fgfs:

-- Min Simgear version is 2019.2.0
CMake Error at CMakeLists.txt:356 (find_package):
  Could not find a package configuration file provided by "SimGear"

Dernière modification par ctesc356 (20/03/2019 9:38:50)


Intel i5 3570 3.4Mhz, Nvidia GTX 660, 8Go Ram, Linux Mint

Hors ligne

#13 20/03/2019 9:44:46

f-toro
Administrateur
Lieu : LFLA
Inscription : 16/12/2007
Messages : 2 522

Re : Erreur compilation FGFS

ctesc356 a écrit :

Bizarre, ici ça passe dans un dossier vierge.

Pas forcément si bizarre que ça.
On ne compare pas deux choses comparables, une compilation sous LM18 et une sous LM19, compte tenu de la différence de version de nombreux paquets.

Pour moi recompilation (par dessus) ce matin, aucun problème.


André. anciennement taureau89_9
Debian Testing Amd64. CM Sabertooth 990FX, FX8350, 32 Go Ram DDR3 1866 Mhz, GTX 750ti 2Go, DD 2To Sata 3, THRUSTMASTER T.Flight StickX, FG 2019.2.0 Git.

Hors ligne

#14 20/03/2019 10:49:37

Patten
Membre
Lieu : LFLR
Inscription : 14/12/2010
Messages : 1 661
Site Web

Re : Erreur compilation FGFS

Bonjour à tous,

f-toro a écrit :

...........

Pour moi recompilation (par dessus) ce matin, aucun problème.

À part quelques "warning", çà passe chez moi.

Le compilation_log.txt  tongue

https://pastebin.com/F5SV3act


smile

Dernière modification par Patten (20/03/2019 10:56:47)


Intel I7.7700k 4.2 GHz 4 C 8 tr.MSI Gaming pro.MSI GTX 1080 Armor 8Go.Ram:16Go DDR4 GSKILL 3000Mhz.Stock:2*480Go SSD Kingston UV 400+2*2T HDD Seagate Baracuda.Alim:Corsair RM750X 80Plus Gold.Ventirad Be quiet pure rock.Boîtier Aérocool GT-S black édition.DVD Asus drw-24f1-mt. Wifi + Bluetooth gigabyte.Dual boot LinuxMint 18.3 Sylvia/Windows10 FG2019.2
http://pattenflightgear.wifeo.com/

Hors ligne

#15 20/03/2019 11:38:36

f-toro
Administrateur
Lieu : LFLA
Inscription : 16/12/2007
Messages : 2 522

Re : Erreur compilation FGFS

Et ce, si ta signature est à jour, Patten, en LM 18.3 comme Clm76.

Ce ne semble donc pas être un problème de version d'OS.


André. anciennement taureau89_9
Debian Testing Amd64. CM Sabertooth 990FX, FX8350, 32 Go Ram DDR3 1866 Mhz, GTX 750ti 2Go, DD 2To Sata 3, THRUSTMASTER T.Flight StickX, FG 2019.2.0 Git.

Hors ligne

#16 20/03/2019 12:40:43

ctesc356
Membre
Inscription : 18/05/2010
Messages : 2 745

Re : Erreur compilation FGFS

Le souci vient de osg.
mint 18.3 vient avec osg 3.2, et malgré qu'il est écrit "minimum required is "3.2.0", il faut maintenant 3.4

donc sous mint 18: compiler osg.(ou copier les binaires "/install/openscenegraph" d'un autre dossier fg =15min de gagnées wink )

ou passer en mint 19.1

Dernière modification par ctesc356 (20/03/2019 12:44:38)


Intel i5 3570 3.4Mhz, Nvidia GTX 660, 8Go Ram, Linux Mint

Hors ligne

#17 20/03/2019 12:57:54

f-toro
Administrateur
Lieu : LFLA
Inscription : 16/12/2007
Messages : 2 522

Re : Erreur compilation FGFS

Je te crois volontiers, puisque j'avais quand même bien l'impression que c'était un problème de version d'OS, donc de paquets trop anciens.

Pourtant ça marche chez Patten qui au vu de son log ne semble pas compiler Osg, alors qu'il est en 18.3...


André. anciennement taureau89_9
Debian Testing Amd64. CM Sabertooth 990FX, FX8350, 32 Go Ram DDR3 1866 Mhz, GTX 750ti 2Go, DD 2To Sata 3, THRUSTMASTER T.Flight StickX, FG 2019.2.0 Git.

Hors ligne

#18 20/03/2019 13:05:00

ctesc356
Membre
Inscription : 18/05/2010
Messages : 2 745

Re : Erreur compilation FGFS

f-toro a écrit :

Pourtant ça marche chez Patten qui au vu de son log ne semble pas compiler Osg, alors qu'il est en 18.3...

Extrait du log de Patten

-- Found OpenSceneGraph: /home/titi38/FGFS/next/install/openscenegraph/lib64/libosgText.so;/home/titi38/FGFS/next/install/openscenegraph/lib64/libosgSim.so;/home/titi38/FGFS/next/install/openscenegraph/lib64/libosgDB.so;/home/titi38/FGFS/next/install/openscenegraph/lib64/libosgParticle.so;/home/titi38/FGFS/next/install/openscenegraph/lib64/libosgGA.so;/home/titi38/FGFS/next/install/openscenegraph/lib64/libosgViewer.so;/home/titi38/FGFS/next/install/openscenegraph/lib64/libosgUtil.so;/home/titi38/FGFS/next/install/openscenegraph/lib64/libosg.so;/home/titi38/FGFS/next/install/openscenegraph/lib64/libOpenThreads.so (found suitable version "3.4.1", minimum required is "3.2.0")

il compile osg wink


Intel i5 3570 3.4Mhz, Nvidia GTX 660, 8Go Ram, Linux Mint

Hors ligne

#19 20/03/2019 13:27:08

Clm76
Membre
Lieu : LFOH
Inscription : 22/10/2012
Messages : 1 048

Re : Erreur compilation FGFS

Lorsque j'ai compilé par-dessus ma version fg2018_4 qui était déjà en osg 3.4.2, il n'y a pas eu de problème, je suis bien passé en fg2019.2
C'est lorsque je compile dans un dossier vierge qu'il y a des erreurs.

Rappel : Dans répertoire vierge (fg2019_2), compilation de PLIB + SIMGEAR + FGFS sans CMAKE : erreurs dans SIMGEAR et  dans FGFS
Dans ce même dossier, recompilation "par-dessus" de CMAKE puis recompilation "par-dessus" de SIMGEAR : erreurs dont voici la fin du log :

[ 77%] Building CXX object simgear/CMakeFiles/SimGearScene.dir/sound/xmlsound.cxx.o
[ 77%] Building CXX object simgear/CMakeFiles/SimGearScene.dir/sound/filters.cxx.o
[ 78%] Building CXX object simgear/CMakeFiles/SimGearScene.dir/sound/soundmgr_openal.cxx.o
[ 78%] Building CXX object simgear/CMakeFiles/SimGearScene.dir/sound/readwav.cxx.o
/home/chris/fg2019_2/simgear/simgear/scene/viewer/Compositor.cxx: In member function ‘void simgear::compositor::Compositor::resized()’:
/home/chris/fg2019_2/simgear/simgear/scene/viewer/Compositor.cxx:198:17: error: ‘class osg::Camera’ has no member named ‘resize’
         camera->resize(pass->viewport_width_scale  * _viewport->width(),
                 ^
simgear/CMakeFiles/SimGearScene.dir/build.make:1661 : la recette pour la cible « simgear/CMakeFiles/SimGearScene.dir/scene/viewer/Compositor.cxx.o » a échouée
make[2]: *** [simgear/CMakeFiles/SimGearScene.dir/scene/viewer/Compositor.cxx.o] Erreur 1
make[2]: *** Attente des tâches non terminées....
CMakeFiles/Makefile2:1148 : la recette pour la cible « simgear/CMakeFiles/SimGearScene.dir/all » a échouée
make[1]: *** [simgear/CMakeFiles/SimGearScene.dir/all] Erreur 2
Makefile:162 : la recette pour la cible « all » a échouée
make: *** [all] Erreur 2
[ 41%] Built target SimGearCore
[ 42%] Building CXX object simgear/CMakeFiles/SimGearScene.dir/scene/viewer/Compositor.cxx.o
/home/chris/fg2019_2/simgear/simgear/scene/viewer/Compositor.cxx: In member function ‘void simgear::compositor::Compositor::resized()’:
/home/chris/fg2019_2/simgear/simgear/scene/viewer/Compositor.cxx:198:17: error: ‘class osg::Camera’ has no member named ‘resize’
         camera->resize(pass->viewport_width_scale  * _viewport->width(),
                 ^
simgear/CMakeFiles/SimGearScene.dir/build.make:1661 : la recette pour la cible « simgear/CMakeFiles/SimGearScene.dir/scene/viewer/Compositor.cxx.o » a échouée
make[2]: *** [simgear/CMakeFiles/SimGearScene.dir/scene/viewer/Compositor.cxx.o] Erreur 1
CMakeFiles/Makefile2:1148 : la recette pour la cible « simgear/CMakeFiles/SimGearScene.dir/all » a échouée
make[1]: *** [simgear/CMakeFiles/SimGearScene.dir/all] Erreur 2
Makefile:162 : la recette pour la cible « all » a échouée
make: *** [all] Erreur 2
All optional package alternatives have found a matching package.

download_and_compile.sh has finished to work

Fg 2019.2.0 - LinuxMint 19.1 Tessa - CM Asus P8H67 MLE - CPU i3 2100T - 12 Go Ram - Nvidia Geforce GTX 770 - Driver Nvidia 430.26
+ Hp notebook-15-da0118nf -  CPU i3-7020u - Ram 4Go - Intel Graphics 620.

Hors ligne

#20 20/03/2019 13:50:27

ctesc356
Membre
Inscription : 18/05/2010
Messages : 2 745

Re : Erreur compilation FGFS

C'est le début qui serait intéressant. Notamment "-- Found OpenSceneGraph: ..."


Intel i5 3570 3.4Mhz, Nvidia GTX 660, 8Go Ram, Linux Mint

Hors ligne

#21 20/03/2019 14:56:19

f-toro
Administrateur
Lieu : LFLA
Inscription : 16/12/2007
Messages : 2 522

Re : Erreur compilation FGFS

ctesc356 a écrit :

il compile osg wink

Ok, il l'avait déjà compilé au préalable, mais pas recompilé dans ce log (inutile).

En testing, il y a déjà pas mal de temps que je ne compile plus Osg.

Le début du log, Clm76 ?


André. anciennement taureau89_9
Debian Testing Amd64. CM Sabertooth 990FX, FX8350, 32 Go Ram DDR3 1866 Mhz, GTX 750ti 2Go, DD 2To Sata 3, THRUSTMASTER T.Flight StickX, FG 2019.2.0 Git.

Hors ligne

#22 20/03/2019 18:02:54

Patten
Membre
Lieu : LFLR
Inscription : 14/12/2010
Messages : 1 661
Site Web

Re : Erreur compilation FGFS

ctesc356 a écrit :

C'est le début qui serait intéressant. Notamment "-- Found OpenSceneGraph: ..."

D'où l'intérêt de mettre le log en entier. hmm

Ma signature est à jour.
Lorsque j'ai changé mon pc, j'ai pas mal guenillé aussi avec la première compilation, le souci venait de OSG, c'est sans doute à cette époque que je l'ai compilé.

Ce qui se réfère à openscenegraph dans mon gestionnaire de paquets:

szolec30.png

szolec29.png

smile


Intel I7.7700k 4.2 GHz 4 C 8 tr.MSI Gaming pro.MSI GTX 1080 Armor 8Go.Ram:16Go DDR4 GSKILL 3000Mhz.Stock:2*480Go SSD Kingston UV 400+2*2T HDD Seagate Baracuda.Alim:Corsair RM750X 80Plus Gold.Ventirad Be quiet pure rock.Boîtier Aérocool GT-S black édition.DVD Asus drw-24f1-mt. Wifi + Bluetooth gigabyte.Dual boot LinuxMint 18.3 Sylvia/Windows10 FG2019.2
http://pattenflightgear.wifeo.com/

Hors ligne

#23 20/03/2019 18:22:43

f-toro
Administrateur
Lieu : LFLA
Inscription : 16/12/2007
Messages : 2 522

Re : Erreur compilation FGFS

La fenêtre About Flightgear indique Osg 3.4, puisque tu l'as compilé.

Mais il n'y a pas que les paquets que tu montres qui sont importants.
Les paquets importants avec openscenegraph sont les paquets libopenscenegraph et libopenscenegraph-dev, sans ce dernier la compilation ne peut pas se faire.

Sur ton système il doit être en 3.2, puisque openscenegraph est en 3.2 .
Raison pour laquelle tu as pas mal "guenillé" à ta première compilation de FG, et ce qui t'a obligé à compiler Osg pour avoir une version 3.4 .

Et raison de plus comme je le pensais de passer en LM19 pour avoir la 3.4 .
Et là, plus besoin de compiler Osg (à condition que les paquet libopenscenegraph soient installés, avec openscenegraph) .


André. anciennement taureau89_9
Debian Testing Amd64. CM Sabertooth 990FX, FX8350, 32 Go Ram DDR3 1866 Mhz, GTX 750ti 2Go, DD 2To Sata 3, THRUSTMASTER T.Flight StickX, FG 2019.2.0 Git.

Hors ligne

#24 20/03/2019 18:31:28

Clm76
Membre
Lieu : LFOH
Inscription : 22/10/2012
Messages : 1 048

Re : Erreur compilation FGFS

f-toro a écrit :

Le début du log, Clm76 ?

Voilà le log entier:

./download_and_compile.sh SIMGEAR
VERSION=$Id
APT_GET_UPDATE=y
DOWNLOAD_PACKAGES=y
COMPILE=y
RECONFIGURE=y
DOWNLOAD=y
JOPTION= -j12 
OOPTION=
BUILD_TYPE=RelWithDebInfo
***********************************
Considering a package alternative: libcurl4-openssl-dev libcurl4-gnutls-dev
Package alternative matched for libcurl4-openssl-dev
Considering a package alternative: libopenscenegraph-3.4-dev libopenscenegraph-dev libopenscenegraph-[0-9]+\.[0-9]+-dev
Package alternative matched for libopenscenegraph-dev
Considering a package alternative: libpng-dev libpng12-dev libpng16-dev
Package alternative matched for libpng12-dev
Considering an optional package alternative: qml-module-qtquick2
Optional package alternative matched for qml-module-qtquick2
Considering an optional package alternative: qml-module-qtquick-window2
Optional package alternative matched for qml-module-qtquick-window2
Considering an optional package alternative: qml-module-qtquick-dialogs
Optional package alternative matched for qml-module-qtquick-dialogs
Considering an optional package alternative: qtbase5-private-dev
Optional package alternative matched for qtbase5-private-dev
Considering an optional package alternative: qtdeclarative5-private-dev
Optional package alternative matched for qtdeclarative5-private-dev
DIRECTORY= /home/chris/fg2019_2
***********************************
****************************************
**************** SIMGEAR ***************
****************************************
-- CMAKE Build type: RelWithDebInfo
-- The C compiler identification is GNU 5.4.0
-- The CXX compiler identification is GNU 5.4.0
-- Check for working C compiler: /usr/bin/cc
-- Check for working C compiler: /usr/bin/cc -- works
-- Detecting C compiler ABI info
-- Detecting C compiler ABI info - done
-- Detecting C compile features
-- Detecting C compile features - done
-- Check for working CXX compiler: /usr/bin/c++
-- Check for working CXX compiler: /usr/bin/c++ -- works
-- Detecting CXX compiler ABI info
-- Detecting CXX compiler ABI info - done
-- Detecting CXX compile features
-- Detecting CXX compile features - done
-- version is 2019 dot 2 dot 0
-- Library installation directory: lib
-- Looking for pthread.h
-- Looking for pthread.h - found
-- Performing Test CMAKE_HAVE_LIBC_PTHREAD
-- Performing Test CMAKE_HAVE_LIBC_PTHREAD - Failed
-- Looking for pthread_create in pthreads
-- Looking for pthread_create in pthreads - not found
-- Looking for pthread_create in pthread
-- Looking for pthread_create in pthread - found
-- Found Threads: TRUE  
-- Boost version: 1.58.0
-- SimGear mode: NORMAL
-- Found OpenGL: /usr/lib/x86_64-linux-gnu/libGL.so   
-- Found OpenAL: /usr/lib/x86_64-linux-gnu/libopenal.so  
-- Sound support: OpenAL
-- Found osgText: /usr/lib/x86_64-linux-gnu/libosgText.so  
-- Found osgSim: /usr/lib/x86_64-linux-gnu/libosgSim.so  
-- Found osgDB: /usr/lib/x86_64-linux-gnu/libosgDB.so  
-- Found osgParticle: /usr/lib/x86_64-linux-gnu/libosgParticle.so  
-- Found osgGA: /usr/lib/x86_64-linux-gnu/libosgGA.so  
-- Found osgViewer: /usr/lib/x86_64-linux-gnu/libosgViewer.so  
-- Found osgUtil: /usr/lib/x86_64-linux-gnu/libosgUtil.so  
-- Found osg: /usr/lib/x86_64-linux-gnu/libosg.so  
-- Found OpenThreads: /usr/lib/x86_64-linux-gnu/libOpenThreads.so  
-- Found OpenSceneGraph: /usr/lib/x86_64-linux-gnu/libosgText.so;/usr/lib/x86_64-linux-gnu/libosgSim.so;/usr/lib/x86_64-linux-gnu/libosgDB.so;/usr/lib/x86_64-linux-gnu/libosgParticle.so;/usr/lib/x86_64-linux-gnu/libosgGA.so;/usr/lib/x86_64-linux-gnu/libosgViewer.so;/usr/lib/x86_64-linux-gnu/libosgUtil.so;/usr/lib/x86_64-linux-gnu/libosg.so;/usr/lib/x86_64-linux-gnu/libOpenThreads.so (found suitable version "3.2.1", minimum required is "3.2.0") 
-- Found ZLIB: /usr/lib/x86_64-linux-gnu/libz.so (found suitable version "1.2.8", minimum required is "1.2.4") 
-- Found CURL: /usr/lib/x86_64-linux-gnu/libcurl.so (found version "7.47.0")  
-- Using built-in expat code
-- Looking for inttypes.h
-- Looking for inttypes.h - found
-- Looking for sys/time.h
-- Looking for sys/time.h - found
-- Looking for unistd.h
-- Looking for unistd.h - found
-- Looking for windows.h
-- Looking for windows.h - not found
-- RTI: DISABLED
-- Looking for gettimeofday
-- Looking for gettimeofday - found
-- Looking for rint
-- Looking for rint - not found
-- Looking for mkdtemp
-- Looking for mkdtemp - found
-- Looking for bcopy
-- Looking for bcopy - found
-- Looking for mmap
-- Looking for mmap - found
-- Looking for timegm
-- Looking for timegm - found
-- Performing Test HAVE_CLOCK_GETTIME
-- Performing Test HAVE_CLOCK_GETTIME - Success
-- Looking for clock_gettime in rt
-- Looking for clock_gettime in rt - found
-- Performing Test HAVE_DLFCN_H
-- Performing Test HAVE_DLFCN_H - Success
-- Looking for dlerror in dl
-- Looking for dlerror in dl - found
-- Performing Test HAVE_STD_ISNAN
-- Performing Test HAVE_STD_ISNAN - Success
-- Performing Test HAVE_WORKING_STD_REGEX
-- Performing Test HAVE_WORKING_STD_REGEX - Success
-- Performing Test GCC_ATOMIC_BUILTINS_FOUND
-- Performing Test GCC_ATOMIC_BUILTINS_FOUND - Success
-- OpenMP: DISABLED
-- Performing Test HAS_NOWARN_UNUSED_TYPEDEFS
-- Performing Test HAS_NOWARN_UNUSED_TYPEDEFS - Success
-- Performing Test HAVE_STD_INDEX_SEQUENCE
-- Performing Test HAVE_STD_INDEX_SEQUENCE - Failed
-- Performing Test HAVE_STD_REMOVE_CV_T
-- Performing Test HAVE_STD_REMOVE_CV_T - Failed
-- Performing Test HAVE_STD_REMOVE_CVREF_T
-- Performing Test HAVE_STD_REMOVE_CVREF_T - Failed
-- Performing Test HAVE_STD_ENABLE_IF_T
-- Performing Test HAVE_STD_ENABLE_IF_T - Failed
-- Performing Test HAVE_STD_BOOL_CONSTANT
-- Performing Test HAVE_STD_BOOL_CONSTANT - Failed
-- Tests: ENABLED
-- DNS resolver: ENABLED
-- Looking for poll
-- Looking for poll - found
-- Looking for getopt
-- Looking for getopt - found
-- Looking for inet_ntop
-- Looking for inet_ntop - found
-- Looking for AF_INET6
-- Looking for AF_INET6 - found
-- Looking for windows.h
-- Looking for windows.h - not found
-- Library building mode: STATIC LIBRARIES
-- Performing Test COMPILER_HAS_HIDDEN_VISIBILITY
-- Performing Test COMPILER_HAS_HIDDEN_VISIBILITY - Success
-- Performing Test COMPILER_HAS_HIDDEN_INLINE_VISIBILITY
-- Performing Test COMPILER_HAS_HIDDEN_INLINE_VISIBILITY - Success
-- Performing Test COMPILER_HAS_DEPRECATED_ATTR
-- Performing Test COMPILER_HAS_DEPRECATED_ATTR - Success
-- Configuring done
-- Generating done
-- Build files have been written to: /home/chris/fg2019_2/build/simgear
MAKE simgear
Scanning dependencies of target SimGearCore
[  1%] Building C object simgear/CMakeFiles/SimGearCore.dir/__/3rdparty/udns/udns_dn.c.o
[  1%] Building C object simgear/CMakeFiles/SimGearCore.dir/__/3rdparty/udns/udns_dntosp.c.o
[  1%] Building C object simgear/CMakeFiles/SimGearCore.dir/__/3rdparty/udns/udns_resolver.c.o
[  1%] Building C object simgear/CMakeFiles/SimGearCore.dir/__/3rdparty/udns/udns_bl.c.o
[  1%] Building C object simgear/CMakeFiles/SimGearCore.dir/__/3rdparty/udns/udns_init.c.o
[  1%] Building C object simgear/CMakeFiles/SimGearCore.dir/__/3rdparty/udns/udns_rr_ptr.c.o
[  2%] Building C object simgear/CMakeFiles/SimGearCore.dir/__/3rdparty/udns/udns_misc.c.o
[  2%] Building C object simgear/CMakeFiles/SimGearCore.dir/__/3rdparty/udns/udns_rr_mx.c.o
[  2%] Building C object simgear/CMakeFiles/SimGearCore.dir/__/3rdparty/udns/udns_rr_srv.c.o
[  3%] Building C object simgear/CMakeFiles/SimGearCore.dir/__/3rdparty/udns/udns_rr_txt.c.o
[  3%] Building C object simgear/CMakeFiles/SimGearCore.dir/__/3rdparty/udns/udns_rr_a.c.o
[  3%] Building C object simgear/CMakeFiles/SimGearCore.dir/__/3rdparty/udns/udns_parse.c.o
[  3%] Building C object simgear/CMakeFiles/SimGearCore.dir/__/3rdparty/udns/udns_rr_naptr.c.o
[  4%] Building C object simgear/CMakeFiles/SimGearCore.dir/__/3rdparty/udns/udns_codes.c.o
[  4%] Building C object simgear/CMakeFiles/SimGearCore.dir/__/3rdparty/udns/udns_jran.c.o
[  4%] Building C object simgear/CMakeFiles/SimGearCore.dir/__/3rdparty/udns/udns_XtoX.c.o
[  4%] Building CXX object simgear/CMakeFiles/SimGearCore.dir/bucket/newbucket.cxx.o
[  4%] Building CXX object simgear/CMakeFiles/SimGearCore.dir/bvh/BVHLineGeometry.cxx.o
[  5%] Building CXX object simgear/CMakeFiles/SimGearCore.dir/bvh/BVHGroup.cxx.o
[  5%] Building CXX object simgear/CMakeFiles/SimGearCore.dir/bvh/BVHLineSegmentVisitor.cxx.o
[  5%] Building CXX object simgear/CMakeFiles/SimGearCore.dir/bvh/BVHMotionTransform.cxx.o
[  6%] Building CXX object simgear/CMakeFiles/SimGearCore.dir/bvh/BVHNode.cxx.o
[  6%] Building CXX object simgear/CMakeFiles/SimGearCore.dir/bvh/BVHPageNode.cxx.o
[  6%] Building CXX object simgear/CMakeFiles/SimGearCore.dir/bvh/BVHPageRequest.cxx.o
[  7%] Building CXX object simgear/CMakeFiles/SimGearCore.dir/bvh/BVHPager.cxx.o
[  7%] Building CXX object simgear/CMakeFiles/SimGearCore.dir/bvh/BVHStaticBinary.cxx.o
[  7%] Building CXX object simgear/CMakeFiles/SimGearCore.dir/bvh/BVHStaticGeometry.cxx.o
[  7%] Building CXX object simgear/CMakeFiles/SimGearCore.dir/bvh/BVHStaticLeaf.cxx.o
[  8%] Building CXX object simgear/CMakeFiles/SimGearCore.dir/bvh/BVHStaticNode.cxx.o
[  8%] Building CXX object simgear/CMakeFiles/SimGearCore.dir/bvh/BVHStaticTriangle.cxx.o
[  8%] Building CXX object simgear/CMakeFiles/SimGearCore.dir/bvh/BVHSubTreeCollector.cxx.o
[  8%] Building CXX object simgear/CMakeFiles/SimGearCore.dir/bvh/BVHMaterial.cxx.o
[  9%] Building CXX object simgear/CMakeFiles/SimGearCore.dir/bvh/BVHTransform.cxx.o
[  9%] Building CXX object simgear/CMakeFiles/SimGearCore.dir/debug/logstream.cxx.o
[  9%] Building CXX object simgear/CMakeFiles/SimGearCore.dir/debug/BufferedLogCallback.cxx.o
[  9%] Building CXX object simgear/CMakeFiles/SimGearCore.dir/embedded_resources/EmbeddedResource.cxx.o
[ 10%] Building CXX object simgear/CMakeFiles/SimGearCore.dir/embedded_resources/EmbeddedResourceManager.cxx.o
[ 10%] Building CXX object simgear/CMakeFiles/SimGearCore.dir/embedded_resources/EmbeddedResourceProxy.cxx.o
[ 10%] Building CXX object simgear/CMakeFiles/SimGearCore.dir/ephemeris/celestialBody.cxx.o
[ 10%] Building CXX object simgear/CMakeFiles/SimGearCore.dir/ephemeris/ephemeris.cxx.o
[ 11%] Building CXX object simgear/CMakeFiles/SimGearCore.dir/ephemeris/jupiter.cxx.o
[ 11%] Building CXX object simgear/CMakeFiles/SimGearCore.dir/ephemeris/mars.cxx.o
[ 11%] Building CXX object simgear/CMakeFiles/SimGearCore.dir/ephemeris/mercury.cxx.o
[ 11%] Building CXX object simgear/CMakeFiles/SimGearCore.dir/ephemeris/moonpos.cxx.o
[ 12%] Building CXX object simgear/CMakeFiles/SimGearCore.dir/ephemeris/neptune.cxx.o
[ 12%] Building CXX object simgear/CMakeFiles/SimGearCore.dir/ephemeris/saturn.cxx.o
[ 12%] Building CXX object simgear/CMakeFiles/SimGearCore.dir/ephemeris/star.cxx.o
[ 12%] Building CXX object simgear/CMakeFiles/SimGearCore.dir/ephemeris/stardata.cxx.o
[ 13%] Building CXX object simgear/CMakeFiles/SimGearCore.dir/ephemeris/uranus.cxx.o
[ 13%] Building CXX object simgear/CMakeFiles/SimGearCore.dir/ephemeris/venus.cxx.o
[ 13%] Building CXX object simgear/CMakeFiles/SimGearCore.dir/io/iostreams/sgstream.cxx.o
[ 14%] Building CXX object simgear/CMakeFiles/SimGearCore.dir/io/iostreams/gzfstream.cxx.o
[ 14%] Building CXX object simgear/CMakeFiles/SimGearCore.dir/io/iostreams/gzcontainerfile.cxx.o
[ 14%] Building CXX object simgear/CMakeFiles/SimGearCore.dir/io/iostreams/CharArrayStream.cxx.o
[ 14%] Building CXX object simgear/CMakeFiles/SimGearCore.dir/io/iostreams/zlibstream.cxx.o
[ 15%] Building CXX object simgear/CMakeFiles/SimGearCore.dir/io/iochannel.cxx.o
[ 15%] Building CXX object simgear/CMakeFiles/SimGearCore.dir/io/lowlevel.cxx.o
[ 15%] Building CXX object simgear/CMakeFiles/SimGearCore.dir/io/raw_socket.cxx.o
[ 15%] Building CXX object simgear/CMakeFiles/SimGearCore.dir/io/sg_binobj.cxx.o
[ 16%] Building CXX object simgear/CMakeFiles/SimGearCore.dir/io/sg_file.cxx.o
[ 16%] Building CXX object simgear/CMakeFiles/SimGearCore.dir/io/sg_netBuffer.cxx.o
[ 16%] Building CXX object simgear/CMakeFiles/SimGearCore.dir/io/sg_netChannel.cxx.o
[ 16%] Building CXX object simgear/CMakeFiles/SimGearCore.dir/io/sg_netChat.cxx.o
[ 17%] Building CXX object simgear/CMakeFiles/SimGearCore.dir/io/sg_serial.cxx.o
[ 17%] Building CXX object simgear/CMakeFiles/SimGearCore.dir/io/sg_socket_udp.cxx.o
[ 17%] Building CXX object simgear/CMakeFiles/SimGearCore.dir/io/sg_socket.cxx.o
[ 17%] Building CXX object simgear/CMakeFiles/SimGearCore.dir/io/HTTPClient.cxx.o
[ 18%] Building CXX object simgear/CMakeFiles/SimGearCore.dir/io/HTTPFileRequest.cxx.o
[ 18%] Building CXX object simgear/CMakeFiles/SimGearCore.dir/io/HTTPMemoryRequest.cxx.o
[ 18%] Building CXX object simgear/CMakeFiles/SimGearCore.dir/io/HTTPRequest.cxx.o
[ 18%] Building CXX object simgear/CMakeFiles/SimGearCore.dir/io/HTTPRepository.cxx.o
[ 19%] Building CXX object simgear/CMakeFiles/SimGearCore.dir/io/untar.cxx.o
[ 19%] Building CXX object simgear/CMakeFiles/SimGearCore.dir/io/DNSClient.cxx.o
[ 19%] Building CXX object simgear/CMakeFiles/SimGearCore.dir/magvar/magvar.cxx.o
[ 20%] Building CXX object simgear/CMakeFiles/SimGearCore.dir/magvar/coremag.cxx.o
[ 20%] Building CXX object simgear/CMakeFiles/SimGearCore.dir/math/SGGeodesy.cxx.o
[ 20%] Building CXX object simgear/CMakeFiles/SimGearCore.dir/math/interpolater.cxx.o
[ 20%] Building CXX object simgear/CMakeFiles/SimGearCore.dir/math/leastsqs.cxx.o
[ 21%] Building C object simgear/CMakeFiles/SimGearCore.dir/math/sg_random.c.o
[ 21%] Building CXX object simgear/CMakeFiles/SimGearCore.dir/misc/CSSBorder.cxx.o
[ 21%] Building CXX object simgear/CMakeFiles/SimGearCore.dir/misc/ResourceManager.cxx.o
[ 21%] Building CXX object simgear/CMakeFiles/SimGearCore.dir/misc/SimpleMarkdown.cxx.o
[ 22%] Building CXX object simgear/CMakeFiles/SimGearCore.dir/misc/SVGpreserveAspectRatio.cxx.o
[ 22%] Building CXX object simgear/CMakeFiles/SimGearCore.dir/misc/argparse.cxx.o
[ 22%] Building CXX object simgear/CMakeFiles/SimGearCore.dir/misc/interpolator.cxx.o
[ 22%] Building CXX object simgear/CMakeFiles/SimGearCore.dir/misc/sg_dir.cxx.o
[ 23%] Building CXX object simgear/CMakeFiles/SimGearCore.dir/misc/sg_path.cxx.o
[ 23%] Building CXX object simgear/CMakeFiles/SimGearCore.dir/misc/sg_hash.cxx.o
[ 23%] Building CXX object simgear/CMakeFiles/SimGearCore.dir/misc/strutils.cxx.o
[ 23%] Building CXX object simgear/CMakeFiles/SimGearCore.dir/misc/tabbed_values.cxx.o
[ 24%] Building CXX object simgear/CMakeFiles/SimGearCore.dir/misc/texcoord.cxx.o
[ 24%] Building C object simgear/CMakeFiles/SimGearCore.dir/nasal/bitslib.c.o
[ 24%] Building C object simgear/CMakeFiles/SimGearCore.dir/nasal/code.c.o
[ 24%] Building C object simgear/CMakeFiles/SimGearCore.dir/nasal/codegen.c.o
[ 25%] Building C object simgear/CMakeFiles/SimGearCore.dir/nasal/gc.c.o
[ 25%] Building C object simgear/CMakeFiles/SimGearCore.dir/nasal/hash.c.o
[ 25%] Building C object simgear/CMakeFiles/SimGearCore.dir/nasal/iolib.c.o
[ 25%] Building C object simgear/CMakeFiles/SimGearCore.dir/nasal/lex.c.o
[ 26%] Building C object simgear/CMakeFiles/SimGearCore.dir/nasal/lib.c.o
[ 26%] Building C object simgear/CMakeFiles/SimGearCore.dir/nasal/mathlib.c.o
[ 26%] Building C object simgear/CMakeFiles/SimGearCore.dir/nasal/misc.c.o
[ 27%] Building C object simgear/CMakeFiles/SimGearCore.dir/nasal/parse.c.o
[ 27%] Building C object simgear/CMakeFiles/SimGearCore.dir/nasal/string.c.o
[ 27%] Building C object simgear/CMakeFiles/SimGearCore.dir/nasal/thread-posix.c.o
[ 27%] Building C object simgear/CMakeFiles/SimGearCore.dir/nasal/thread-win32.c.o
[ 28%] Building C object simgear/CMakeFiles/SimGearCore.dir/nasal/threadlib.c.o
[ 28%] Building C object simgear/CMakeFiles/SimGearCore.dir/nasal/utf8lib.c.o
[ 28%] Building C object simgear/CMakeFiles/SimGearCore.dir/nasal/vector.c.o
[ 28%] Building CXX object simgear/CMakeFiles/SimGearCore.dir/nasal/cppbind/Ghost.cxx.o
[ 29%] Building CXX object simgear/CMakeFiles/SimGearCore.dir/nasal/cppbind/NasalContext.cxx.o
[ 29%] Building CXX object simgear/CMakeFiles/SimGearCore.dir/nasal/cppbind/NasalHash.cxx.o
[ 29%] Building CXX object simgear/CMakeFiles/SimGearCore.dir/nasal/cppbind/NasalString.cxx.o
[ 29%] Building CXX object simgear/CMakeFiles/SimGearCore.dir/nasal/cppbind/NasalObject.cxx.o
[ 30%] Building CXX object simgear/CMakeFiles/SimGearCore.dir/nasal/cppbind/detail/from_nasal_helper.cxx.o
[ 30%] Building CXX object simgear/CMakeFiles/SimGearCore.dir/nasal/cppbind/detail/to_nasal_helper.cxx.o
[ 30%] Building CXX object simgear/CMakeFiles/SimGearCore.dir/props/AtomicChangeListener.cxx.o
[ 30%] Building CXX object simgear/CMakeFiles/SimGearCore.dir/props/condition.cxx.o
[ 31%] Building CXX object simgear/CMakeFiles/SimGearCore.dir/props/easing_functions.cxx.o
[ 31%] Building CXX object simgear/CMakeFiles/SimGearCore.dir/props/PropertyBasedElement.cxx.o
[ 31%] Building CXX object simgear/CMakeFiles/SimGearCore.dir/props/PropertyBasedMgr.cxx.o
[ 31%] Building CXX object simgear/CMakeFiles/SimGearCore.dir/props/PropertyInterpolationMgr.cxx.o
[ 32%] Building CXX object simgear/CMakeFiles/SimGearCore.dir/props/PropertyInterpolator.cxx.o
[ 32%] Building CXX object simgear/CMakeFiles/SimGearCore.dir/props/propertyObject.cxx.o
[ 32%] Building CXX object simgear/CMakeFiles/SimGearCore.dir/props/props.cxx.o
[ 32%] Building CXX object simgear/CMakeFiles/SimGearCore.dir/props/props_io.cxx.o
[ 32%] Building CXX object simgear/CMakeFiles/SimGearCore.dir/structure/SGAtomic.cxx.o
[ 33%] Building CXX object simgear/CMakeFiles/SimGearCore.dir/serial/serial.cxx.o
[ 33%] Building CXX object simgear/CMakeFiles/SimGearCore.dir/structure/SGBinding.cxx.o
[ 34%] Building CXX object simgear/CMakeFiles/SimGearCore.dir/structure/SGExpression.cxx.o
[ 34%] Building CXX object simgear/CMakeFiles/SimGearCore.dir/structure/SGSmplhist.cxx.o
[ 34%] Building CXX object simgear/CMakeFiles/SimGearCore.dir/structure/SGSmplstat.cxx.o
[ 34%] Building CXX object simgear/CMakeFiles/SimGearCore.dir/structure/SGPerfMon.cxx.o
[ 35%] Building CXX object simgear/CMakeFiles/SimGearCore.dir/structure/StringTable.cxx.o
[ 35%] Building CXX object simgear/CMakeFiles/SimGearCore.dir/structure/commands.cxx.o
[ 35%] Building CXX object simgear/CMakeFiles/SimGearCore.dir/structure/event_mgr.cxx.o
[ 35%] Building CXX object simgear/CMakeFiles/SimGearCore.dir/structure/exception.cxx.o
[ 36%] Building CXX object simgear/CMakeFiles/SimGearCore.dir/structure/subsystem_mgr.cxx.o
[ 36%] Building CXX object simgear/CMakeFiles/SimGearCore.dir/structure/StateMachine.cxx.o
[ 36%] Building CXX object simgear/CMakeFiles/SimGearCore.dir/threads/SGThread.cxx.o
[ 37%] Building CXX object simgear/CMakeFiles/SimGearCore.dir/timing/sg_time.cxx.o
[ 37%] Building CXX object simgear/CMakeFiles/SimGearCore.dir/timing/lowleveltime.cxx.o
[ 37%] Building CXX object simgear/CMakeFiles/SimGearCore.dir/timing/timestamp.cxx.o
[ 37%] Building CXX object simgear/CMakeFiles/SimGearCore.dir/timing/timezone.cxx.o
[ 37%] Building CXX object simgear/CMakeFiles/SimGearCore.dir/xml/easyxml.cxx.o
[ 38%] Building CXX object simgear/CMakeFiles/SimGearCore.dir/package/Catalog.cxx.o
[ 38%] Building CXX object simgear/CMakeFiles/SimGearCore.dir/package/Package.cxx.o
[ 38%] Building CXX object simgear/CMakeFiles/SimGearCore.dir/package/Install.cxx.o
[ 38%] Building CXX object simgear/CMakeFiles/SimGearCore.dir/package/Root.cxx.o
[ 39%] Building CXX object simgear/CMakeFiles/SimGearCore.dir/package/Delegate.cxx.o
[ 39%] Building C object simgear/CMakeFiles/SimGearCore.dir/package/md5.c.o
[ 39%] Building C object simgear/CMakeFiles/SimGearCore.dir/package/ioapi.c.o
[ 40%] Building C object simgear/CMakeFiles/SimGearCore.dir/package/ioapi_mem.c.o
[ 40%] Building C object simgear/CMakeFiles/SimGearCore.dir/package/unzip.c.o
[ 40%] Building CXX object simgear/CMakeFiles/SimGearCore.dir/scene/tsync/terrasync.cxx.o
[ 40%] Building C object simgear/CMakeFiles/SimGearCore.dir/__/3rdparty/expat/hashtable.c.o
[ 41%] Building C object simgear/CMakeFiles/SimGearCore.dir/__/3rdparty/expat/xmlparse.c.o
[ 41%] Building C object simgear/CMakeFiles/SimGearCore.dir/__/3rdparty/expat/xmlrole.c.o
[ 41%] Building C object simgear/CMakeFiles/SimGearCore.dir/__/3rdparty/expat/xmltok.c.o
/home/chris/fg2019_2/simgear/simgear/structure/subsystem_mgr.cxx:1435:10: warning: ‘void {anonymous}::registerSubsystemCommands()’ defined but not used [-Wunused-function]
     void registerSubsystemCommands()
          ^
[ 41%] Linking CXX static library libSimGearCore.a
[ 41%] Built target SimGearCore
Scanning dependencies of target test_magvar
[ 41%] Building CXX object simgear/magvar/CMakeFiles/test_magvar.dir/testmagvar.cxx.o
Scanning dependencies of target bvhtest
[ 41%] Building CXX object simgear/bvh/CMakeFiles/bvhtest.dir/bvhtest.cxx.o
Scanning dependencies of target SimGearScene
[ 41%] Building C object simgear/CMakeFiles/SimGearScene.dir/canvas/ShivaVG/src/shContext.c.o
[ 41%] Building C object simgear/CMakeFiles/SimGearScene.dir/canvas/ShivaVG/src/shExtensions.c.o
[ 42%] Building C object simgear/CMakeFiles/SimGearScene.dir/canvas/ShivaVG/src/shArrays.c.o
[ 42%] Building C object simgear/CMakeFiles/SimGearScene.dir/canvas/ShivaVG/src/shVectors.c.o
[ 42%] Building C object simgear/CMakeFiles/SimGearScene.dir/canvas/ShivaVG/src/shGeometry.c.o
[ 42%] Building C object simgear/CMakeFiles/SimGearScene.dir/canvas/ShivaVG/src/shPaint.c.o
[ 43%] Building C object simgear/CMakeFiles/SimGearScene.dir/canvas/ShivaVG/src/shPipeline.c.o
[ 43%] Building C object simgear/CMakeFiles/SimGearScene.dir/canvas/ShivaVG/src/shPath.c.o
[ 44%] Building C object simgear/CMakeFiles/SimGearScene.dir/canvas/ShivaVG/src/shImage.c.o
[ 44%] Building C object simgear/CMakeFiles/SimGearScene.dir/canvas/ShivaVG/src/shParams.c.o
[ 45%] Linking CXX executable test_magvar
[ 45%] Built target test_magvar
[ 45%] Building C object simgear/CMakeFiles/SimGearScene.dir/canvas/ShivaVG/src/shVgu.c.o
[ 45%] Building CXX object simgear/CMakeFiles/SimGearScene.dir/canvas/elements/CanvasElement.cxx.o
[ 46%] Building CXX object simgear/CMakeFiles/SimGearScene.dir/canvas/elements/CanvasGroup.cxx.o
[ 46%] Building CXX object simgear/CMakeFiles/SimGearScene.dir/canvas/elements/CanvasImage.cxx.o
[ 46%] Building CXX object simgear/CMakeFiles/SimGearScene.dir/canvas/elements/CanvasMap.cxx.o
[ 46%] Building CXX object simgear/CMakeFiles/SimGearScene.dir/canvas/elements/CanvasPath.cxx.o
[ 47%] Building CXX object simgear/CMakeFiles/SimGearScene.dir/canvas/elements/CanvasText.cxx.o
[ 47%] Building CXX object simgear/CMakeFiles/SimGearScene.dir/canvas/events/CustomEvent.cxx.o
[ 47%] Building CXX object simgear/CMakeFiles/SimGearScene.dir/canvas/events/DeviceEvent.cxx.o
[ 47%] Building CXX object simgear/CMakeFiles/SimGearScene.dir/canvas/events/MouseEvent.cxx.o
[ 48%] Building CXX object simgear/CMakeFiles/SimGearScene.dir/canvas/events/KeyboardEvent.cxx.o
[ 49%] Linking CXX executable bvhtest
[ 49%] Building CXX object simgear/CMakeFiles/SimGearScene.dir/canvas/layout/BoxLayout.cxx.o
[ 49%] Built target bvhtest
[ 49%] Building CXX object simgear/CMakeFiles/SimGearScene.dir/canvas/layout/Layout.cxx.o
/home/chris/fg2019_2/simgear/simgear/canvas/elements/CanvasText.cxx: In member function ‘osg::Vec2 simgear::canvas::TextLine::cursorPos(size_t) const’:
/home/chris/fg2019_2/simgear/simgear/canvas/elements/CanvasText.cxx:175:34: warning: unused variable ‘coords’ [-Wunused-variable]
       GlyphQuads::Coords2 const& coords = _quads->_coords;
                                  ^
/home/chris/fg2019_2/simgear/simgear/canvas/elements/CanvasText.cxx: In member function ‘osg::Vec2 simgear::canvas::TextLine::nearestCursor(float) const’:
/home/chris/fg2019_2/simgear/simgear/canvas/elements/CanvasText.cxx:214:31: warning: unused variable ‘glyphs’ [-Wunused-variable]
     GlyphQuads::Glyphs const& glyphs = _quads->_glyphs;
                               ^
/home/chris/fg2019_2/simgear/simgear/canvas/elements/CanvasText.cxx:216:32: warning: unused variable ‘coords’ [-Wunused-variable]
     GlyphQuads::Coords2 const& coords = _quads->_coords;
                                ^
[ 50%] Building CXX object simgear/CMakeFiles/SimGearScene.dir/canvas/layout/LayoutItem.cxx.o
[ 50%] Building CXX object simgear/CMakeFiles/SimGearScene.dir/canvas/layout/NasalWidget.cxx.o
[ 50%] Building CXX object simgear/CMakeFiles/SimGearScene.dir/canvas/layout/SpacerItem.cxx.o
[ 50%] Building CXX object simgear/CMakeFiles/SimGearScene.dir/canvas/Canvas.cxx.o
/home/chris/fg2019_2/simgear/simgear/canvas/elements/CanvasText.cxx:244:3: warning: control reaches end of non-void function [-Wreturn-type]
   }
   ^
[ 51%] Building CXX object simgear/CMakeFiles/SimGearScene.dir/canvas/CanvasEvent.cxx.o
[ 51%] Building CXX object simgear/CMakeFiles/SimGearScene.dir/canvas/CanvasEventManager.cxx.o
[ 51%] Building CXX object simgear/CMakeFiles/SimGearScene.dir/canvas/CanvasEventVisitor.cxx.o
[ 51%] Building CXX object simgear/CMakeFiles/SimGearScene.dir/canvas/CanvasMgr.cxx.o
[ 52%] Building CXX object simgear/CMakeFiles/SimGearScene.dir/canvas/CanvasObjectPlacement.cxx.o
[ 52%] Building CXX object simgear/CMakeFiles/SimGearScene.dir/canvas/CanvasPlacement.cxx.o
[ 52%] Building CXX object simgear/CMakeFiles/SimGearScene.dir/canvas/CanvasWindow.cxx.o
[ 52%] Building CXX object simgear/CMakeFiles/SimGearScene.dir/canvas/ODGauge.cxx.o
[ 53%] Building CXX object simgear/CMakeFiles/SimGearScene.dir/canvas/VGInitOperation.cxx.o
[ 53%] Building CXX object simgear/CMakeFiles/SimGearScene.dir/environment/metar.cxx.o
[ 53%] Building CXX object simgear/CMakeFiles/SimGearScene.dir/environment/precipitation.cxx.o
[ 53%] Building CXX object simgear/CMakeFiles/SimGearScene.dir/screen/extensions.cxx.o
[ 54%] Building CXX object simgear/CMakeFiles/SimGearScene.dir/screen/screen-dump.cxx.o
[ 54%] Building CXX object simgear/CMakeFiles/SimGearScene.dir/screen/tr.cxx.o
[ 54%] Building CXX object simgear/CMakeFiles/SimGearScene.dir/scene/material/Effect.cxx.o
[ 54%] Building CXX object simgear/CMakeFiles/SimGearScene.dir/scene/material/EffectBuilder.cxx.o
[ 55%] Building CXX object simgear/CMakeFiles/SimGearScene.dir/scene/material/EffectCullVisitor.cxx.o
[ 55%] Building CXX object simgear/CMakeFiles/SimGearScene.dir/scene/material/EffectGeode.cxx.o
[ 55%] Building CXX object simgear/CMakeFiles/SimGearScene.dir/scene/material/Pass.cxx.o
[ 56%] Building CXX object simgear/CMakeFiles/SimGearScene.dir/scene/material/Technique.cxx.o
[ 56%] Building CXX object simgear/CMakeFiles/SimGearScene.dir/scene/material/TextureBuilder.cxx.o
[ 56%] Building CXX object simgear/CMakeFiles/SimGearScene.dir/scene/material/makeEffect.cxx.o
[ 56%] Building CXX object simgear/CMakeFiles/SimGearScene.dir/scene/material/mat.cxx.o
[ 57%] Building CXX object simgear/CMakeFiles/SimGearScene.dir/scene/material/matlib.cxx.o
[ 57%] Building CXX object simgear/CMakeFiles/SimGearScene.dir/scene/material/matmodel.cxx.o
[ 57%] Building CXX object simgear/CMakeFiles/SimGearScene.dir/scene/material/mipmap.cxx.o
[ 57%] Building CXX object simgear/CMakeFiles/SimGearScene.dir/scene/material/parseBlendFunc.cxx.o
[ 58%] Building CXX object simgear/CMakeFiles/SimGearScene.dir/scene/model/BVHPageNodeOSG.cxx.o
[ 58%] Building CXX object simgear/CMakeFiles/SimGearScene.dir/scene/model/CheckSceneryVisitor.cxx.o
[ 58%] Building CXX object simgear/CMakeFiles/SimGearScene.dir/scene/model/ConditionNode.cxx.o
[ 58%] Building CXX object simgear/CMakeFiles/SimGearScene.dir/scene/model/ModelRegistry.cxx.o
[ 59%] Building CXX object simgear/CMakeFiles/SimGearScene.dir/scene/model/PrimitiveCollector.cxx.o
[ 59%] Building CXX object simgear/CMakeFiles/SimGearScene.dir/scene/model/SGClipGroup.cxx.o
[ 59%] Building CXX object simgear/CMakeFiles/SimGearScene.dir/scene/model/SGInteractionAnimation.cxx.o
[ 59%] Building CXX object simgear/CMakeFiles/SimGearScene.dir/scene/model/SGLightAnimation.cxx.o
[ 60%] Building CXX object simgear/CMakeFiles/SimGearScene.dir/scene/model/SGPickAnimation.cxx.o
[ 60%] Building CXX object simgear/CMakeFiles/SimGearScene.dir/scene/model/SGMaterialAnimation.cxx.o
[ 60%] Building CXX object simgear/CMakeFiles/SimGearScene.dir/scene/model/SGOffsetTransform.cxx.o
[ 60%] Building CXX object simgear/CMakeFiles/SimGearScene.dir/scene/model/SGReaderWriterXML.cxx.o
[ 61%] Building CXX object simgear/CMakeFiles/SimGearScene.dir/scene/model/SGRotateTransform.cxx.o
[ 61%] Building CXX object simgear/CMakeFiles/SimGearScene.dir/scene/model/SGScaleTransform.cxx.o
[ 61%] Building CXX object simgear/CMakeFiles/SimGearScene.dir/scene/model/SGText.cxx.o
[ 62%] Building CXX object simgear/CMakeFiles/SimGearScene.dir/scene/model/SGTrackToAnimation.cxx.o
[ 62%] Building CXX object simgear/CMakeFiles/SimGearScene.dir/scene/model/SGTranslateTransform.cxx.o
[ 62%] Building CXX object simgear/CMakeFiles/SimGearScene.dir/scene/model/animation.cxx.o
[ 62%] Building CXX object simgear/CMakeFiles/SimGearScene.dir/scene/model/model.cxx.o
[ 63%] Building CXX object simgear/CMakeFiles/SimGearScene.dir/scene/model/modellib.cxx.o
[ 63%] Building CXX object simgear/CMakeFiles/SimGearScene.dir/scene/model/particles.cxx.o
[ 63%] Building CXX object simgear/CMakeFiles/SimGearScene.dir/scene/model/persparam.cxx.o
[ 63%] Building CXX object simgear/CMakeFiles/SimGearScene.dir/scene/model/placement.cxx.o
[ 64%] Building CXX object simgear/CMakeFiles/SimGearScene.dir/scene/model/shadanim.cxx.o
[ 64%] Building CXX object simgear/CMakeFiles/SimGearScene.dir/scene/sky/CloudShaderGeometry.cxx.o
[ 64%] Building CXX object simgear/CMakeFiles/SimGearScene.dir/scene/sky/cloud.cxx.o
[ 64%] Building CXX object simgear/CMakeFiles/SimGearScene.dir/scene/sky/cloudfield.cxx.o
[ 65%] Building CXX object simgear/CMakeFiles/SimGearScene.dir/scene/sky/dome.cxx.o
[ 65%] Building CXX object simgear/CMakeFiles/SimGearScene.dir/scene/sky/moon.cxx.o
[ 65%] Building CXX object simgear/CMakeFiles/SimGearScene.dir/scene/sky/newcloud.cxx.o
[ 65%] Building CXX object simgear/CMakeFiles/SimGearScene.dir/scene/sky/oursun.cxx.o
[ 66%] Building CXX object simgear/CMakeFiles/SimGearScene.dir/scene/sky/sky.cxx.o
[ 66%] Building CXX object simgear/CMakeFiles/SimGearScene.dir/scene/sky/sphere.cxx.o
[ 66%] Building CXX object simgear/CMakeFiles/SimGearScene.dir/scene/sky/stars.cxx.o
[ 66%] Building CXX object simgear/CMakeFiles/SimGearScene.dir/scene/tgdb/GroundLightManager.cxx.o
[ 67%] Building CXX object simgear/CMakeFiles/SimGearScene.dir/scene/tgdb/ReaderWriterSPT.cxx.o
[ 67%] Building CXX object simgear/CMakeFiles/SimGearScene.dir/scene/tgdb/ReaderWriterSTG.cxx.o
[ 67%] Building CXX object simgear/CMakeFiles/SimGearScene.dir/scene/tgdb/SGBuildingBin.cxx.o
[ 67%] Building CXX object simgear/CMakeFiles/SimGearScene.dir/scene/tgdb/SGOceanTile.cxx.o
[ 68%] Building CXX object simgear/CMakeFiles/SimGearScene.dir/scene/tgdb/SGReaderWriterBTG.cxx.o
[ 68%] Building CXX object simgear/CMakeFiles/SimGearScene.dir/scene/tgdb/SGVasiDrawable.cxx.o
[ 68%] Building CXX object simgear/CMakeFiles/SimGearScene.dir/scene/tgdb/ShaderGeometry.cxx.o
[ 69%] Building CXX object simgear/CMakeFiles/SimGearScene.dir/scene/tgdb/TreeBin.cxx.o
[ 69%] Building CXX object simgear/CMakeFiles/SimGearScene.dir/scene/tgdb/apt_signs.cxx.o
[ 69%] Building CXX object simgear/CMakeFiles/SimGearScene.dir/scene/tgdb/obj.cxx.o
[ 69%] Building CXX object simgear/CMakeFiles/SimGearScene.dir/scene/tgdb/pt_lights.cxx.o
[ 70%] Building CXX object simgear/CMakeFiles/SimGearScene.dir/scene/tgdb/userdata.cxx.o
[ 70%] Building CXX object simgear/CMakeFiles/SimGearScene.dir/scene/util/ColorInterpolator.cxx.o
[ 70%] Building CXX object simgear/CMakeFiles/SimGearScene.dir/scene/util/CopyOp.cxx.o
[ 70%] Building CXX object simgear/CMakeFiles/SimGearScene.dir/scene/util/DeletionManager.cxx.o
[ 71%] Building CXX object simgear/CMakeFiles/SimGearScene.dir/scene/util/NodeAndDrawableVisitor.cxx.o
[ 71%] Building CXX object simgear/CMakeFiles/SimGearScene.dir/scene/util/Noise.cxx.o
[ 71%] Building CXX object simgear/CMakeFiles/SimGearScene.dir/scene/util/OptionsReadFileCallback.cxx.o
[ 71%] Building CXX object simgear/CMakeFiles/SimGearScene.dir/scene/util/OsgDebug.cxx.o
[ 72%] Building CXX object simgear/CMakeFiles/SimGearScene.dir/scene/util/parse_color.cxx.o
[ 72%] Building CXX object simgear/CMakeFiles/SimGearScene.dir/scene/util/PrimitiveUtils.cxx.o
[ 72%] Building CXX object simgear/CMakeFiles/SimGearScene.dir/scene/util/QuadTreeBuilder.cxx.o
[ 72%] Building CXX object simgear/CMakeFiles/SimGearScene.dir/scene/util/SGEnlargeBoundingBox.cxx.o
[ 73%] Building CXX object simgear/CMakeFiles/SimGearScene.dir/scene/util/SGImageUtils.cxx.o
[ 73%] Building CXX object simgear/CMakeFiles/SimGearScene.dir/scene/util/SGReaderWriterOptions.cxx.o
[ 73%] Building CXX object simgear/CMakeFiles/SimGearScene.dir/scene/util/SGSceneFeatures.cxx.o
[ 73%] Building CXX object simgear/CMakeFiles/SimGearScene.dir/scene/util/SGSceneUserData.cxx.o
[ 74%] Building CXX object simgear/CMakeFiles/SimGearScene.dir/scene/util/SGStateAttributeVisitor.cxx.o
[ 74%] Building CXX object simgear/CMakeFiles/SimGearScene.dir/scene/util/SGTextureStateAttributeVisitor.cxx.o
[ 74%] Building CXX object simgear/CMakeFiles/SimGearScene.dir/scene/util/SplicingVisitor.cxx.o
[ 74%] Building CXX object simgear/CMakeFiles/SimGearScene.dir/scene/util/StateAttributeFactory.cxx.o
[ 75%] Building CXX object simgear/CMakeFiles/SimGearScene.dir/scene/util/UpdateOnceCallback.cxx.o
[ 75%] Building CXX object simgear/CMakeFiles/SimGearScene.dir/scene/util/project.cxx.o
[ 75%] Building CXX object simgear/CMakeFiles/SimGearScene.dir/scene/viewer/ClusteredForward.cxx.o
/home/chris/fg2019_2/simgear/simgear/scene/util/SGImageUtils.cxx: In static member function ‘static void simgear::{anonymous}::ColorWriter<32818, unsigned char>::write(const simgear::ImageUtils::PixelWriter*, const osg::Vec4f&, int, int, int, int)’:
/home/chris/fg2019_2/simgear/simgear/scene/util/SGImageUtils.cxx:1815:22: warning: unused variable ‘ptr’ [-Wunused-variable]
             GLubyte* ptr = (GLubyte*)iw->data(s, t, r, m);
                      ^
[ 76%] Building CXX object simgear/CMakeFiles/SimGearScene.dir/scene/viewer/Compositor.cxx.o
[ 76%] Building CXX object simgear/CMakeFiles/SimGearScene.dir/scene/viewer/CompositorBuffer.cxx.o
[ 76%] Building CXX object simgear/CMakeFiles/SimGearScene.dir/scene/viewer/CompositorPass.cxx.o
[ 76%] Building CXX object simgear/CMakeFiles/SimGearScene.dir/scene/viewer/CompositorUtil.cxx.o
[ 77%] Building CXX object simgear/CMakeFiles/SimGearScene.dir/sound/sample.cxx.o
[ 77%] Building CXX object simgear/CMakeFiles/SimGearScene.dir/sound/sample_group.cxx.o
[ 77%] Building CXX object simgear/CMakeFiles/SimGearScene.dir/sound/xmlsound.cxx.o
[ 77%] Building CXX object simgear/CMakeFiles/SimGearScene.dir/sound/filters.cxx.o
[ 78%] Building CXX object simgear/CMakeFiles/SimGearScene.dir/sound/soundmgr_openal.cxx.o
[ 78%] Building CXX object simgear/CMakeFiles/SimGearScene.dir/sound/readwav.cxx.o
/home/chris/fg2019_2/simgear/simgear/scene/viewer/Compositor.cxx: In member function ‘void simgear::compositor::Compositor::resized()’:
/home/chris/fg2019_2/simgear/simgear/scene/viewer/Compositor.cxx:198:17: error: ‘class osg::Camera’ has no member named ‘resize’
         camera->resize(pass->viewport_width_scale  * _viewport->width(),
                 ^
simgear/CMakeFiles/SimGearScene.dir/build.make:1661 : la recette pour la cible « simgear/CMakeFiles/SimGearScene.dir/scene/viewer/Compositor.cxx.o » a échouée
make[2]: *** [simgear/CMakeFiles/SimGearScene.dir/scene/viewer/Compositor.cxx.o] Erreur 1
make[2]: *** Attente des tâches non terminées....
CMakeFiles/Makefile2:1148 : la recette pour la cible « simgear/CMakeFiles/SimGearScene.dir/all » a échouée
make[1]: *** [simgear/CMakeFiles/SimGearScene.dir/all] Erreur 2
Makefile:162 : la recette pour la cible « all » a échouée
make: *** [all] Erreur 2
INSTALL simgear
[ 41%] Built target SimGearCore
[ 42%] Building CXX object simgear/CMakeFiles/SimGearScene.dir/scene/viewer/Compositor.cxx.o
/home/chris/fg2019_2/simgear/simgear/scene/viewer/Compositor.cxx: In member function ‘void simgear::compositor::Compositor::resized()’:
/home/chris/fg2019_2/simgear/simgear/scene/viewer/Compositor.cxx:198:17: error: ‘class osg::Camera’ has no member named ‘resize’
         camera->resize(pass->viewport_width_scale  * _viewport->width(),
                 ^
simgear/CMakeFiles/SimGearScene.dir/build.make:1661 : la recette pour la cible « simgear/CMakeFiles/SimGearScene.dir/scene/viewer/Compositor.cxx.o » a échouée
make[2]: *** [simgear/CMakeFiles/SimGearScene.dir/scene/viewer/Compositor.cxx.o] Erreur 1
CMakeFiles/Makefile2:1148 : la recette pour la cible « simgear/CMakeFiles/SimGearScene.dir/all » a échouée
make[1]: *** [simgear/CMakeFiles/SimGearScene.dir/all] Erreur 2
Makefile:162 : la recette pour la cible « all » a échouée
make: *** [all] Erreur 2
***********************************
All optional package alternatives have found a matching package.

Fg 2019.2.0 - LinuxMint 19.1 Tessa - CM Asus P8H67 MLE - CPU i3 2100T - 12 Go Ram - Nvidia Geforce GTX 770 - Driver Nvidia 430.26
+ Hp notebook-15-da0118nf -  CPU i3-7020u - Ram 4Go - Intel Graphics 620.

Hors ligne

#25 20/03/2019 18:36:33

f-toro
Administrateur
Lieu : LFLA
Inscription : 16/12/2007
Messages : 2 522

Re : Erreur compilation FGFS

-- Found OpenSceneGraph: /usr/lib/x86_64-linux-gnu/libosgText.so;/usr/lib/x86_64-linux-gnu/libosgSim.so;/usr/lib/x86_64-linux-gnu/libosgDB.so;/usr/lib/x86_64-linux-gnu/libosgParticle.so;/usr/lib/x86_64-linux-gnu/libosgGA.so;/usr/lib/x86_64-linux-gnu/libosgViewer.so;/usr/lib/x86_64-linux-gnu/libosgUtil.so;/usr/lib/x86_64-linux-gnu/libosg.so;/usr/lib/x86_64-linux-gnu/libOpenThreads.so (found suitable version "3.2.1", minimum required is "3.2.0")

Passe en LM19 et tous tes soucis disparaîtront.
De toute manière LM18 c'est déjà ancien et il faudra bien que tu te mettes un jour... à jour.
Sinon soucis de plus en plus fréquents assurés.


André. anciennement taureau89_9
Debian Testing Amd64. CM Sabertooth 990FX, FX8350, 32 Go Ram DDR3 1866 Mhz, GTX 750ti 2Go, DD 2To Sata 3, THRUSTMASTER T.Flight StickX, FG 2019.2.0 Git.

Hors ligne

Pied de page des forums