Forum Flightgear France

Une communauté prend son envol

Vous n'êtes pas identifié(e).

Annonce

Futur nouvel inscrit, tu dois au préalable lire l'intégralité des 10 articles des règles, s'il te plaît. Tout nouveau compte qui ne respecte pas les règles sera supprimé par l'administration.

#26 20/03/2019 19:35:25

Clm76
Membre
Lieu : LFOH
Inscription : 22/10/2012
Messages : 1 043

Re : Erreur compilation FGFS

f-toro a écrit :

Passe en LM19 et tous tes soucis disparaîtront.

Hum !... Je ne suis pas du tout sûr que ce soit un problème de version de LM car j'ai pu, sans difficultés, upgrader ma version 2018.4 en 2019.2. Ceci dit j'y passerai certainement un jour ...

@Christian, je n'ai pas de librairies Openscenegraph installées par LM. Je compile OSG en même temps de Fg. De toute façon, les librairies Osg de LM ne sont qu'en 3.2 alors qu'en compilant on a la version 3.4.

J'ai continué mes manips avec mon nouveau répertoire :
Après les erreurs de SIMGEAR (dues à OSG) j'ai compilé OSG puis recompilé SIMGEAR et toutes les erreurs de SIMGEAR ont disparues. smile
J'ai ensuite recompilé FGFS mais j'ai toujours un blocage au niveau de "fgpanel". Le log :

./download_and_compile.sh FGFS
VERSION=$Id
APT_GET_UPDATE=y
DOWNLOAD_PACKAGES=y
COMPILE=y
RECONFIGURE=y
DOWNLOAD=y
JOPTION= -j12 
OOPTION=
BUILD_TYPE=RelWithDebInfo
***********************************
Considering a package alternative: libcurl4-openssl-dev libcurl4-gnutls-dev
Package alternative matched for libcurl4-openssl-dev
Considering a package alternative: libopenscenegraph-3.4-dev libopenscenegraph-dev libopenscenegraph-[0-9]+\.[0-9]+-dev
Package alternative matched for libopenscenegraph-dev
Considering a package alternative: libpng-dev libpng12-dev libpng16-dev
Package alternative matched for libpng12-dev
Considering an optional package alternative: qml-module-qtquick2
Optional package alternative matched for qml-module-qtquick2
Considering an optional package alternative: qml-module-qtquick-window2
Optional package alternative matched for qml-module-qtquick-window2
Considering an optional package alternative: qml-module-qtquick-dialogs
Optional package alternative matched for qml-module-qtquick-dialogs
Considering an optional package alternative: qtbase5-private-dev
Optional package alternative matched for qtbase5-private-dev
Considering an optional package alternative: qtdeclarative5-private-dev
Optional package alternative matched for qtdeclarative5-private-dev
DIRECTORY= /home/chris/fg2019_2
***********************************
****************************************
************** FLIGHTGEAR **************
****************************************
CMAKE Build type: RelWithDebInfo
-- Setting build type to 'Dev' as none was specified.
-- The C compiler identification is GNU 5.4.0
-- The CXX compiler identification is GNU 5.4.0
-- Check for working C compiler: /usr/bin/cc
-- Check for working C compiler: /usr/bin/cc -- works
-- Detecting C compiler ABI info
-- Detecting C compiler ABI info - done
-- Detecting C compile features
-- Detecting C compile features - done
-- Check for working CXX compiler: /usr/bin/c++
-- Check for working CXX compiler: /usr/bin/c++ -- works
-- Detecting CXX compiler ABI info
-- Detecting CXX compiler ABI info - done
-- Detecting CXX compile features
-- Detecting CXX compile features - done
-- System is: Linux
-- Linux distro is: LinuxMint
-- Web browser launcher command is: xdg-open
-- Using default data directory for base package:  /home/chris/fg2019_2/install/flightgear/lib/FlightGear
-- Looking for pthread.h
-- Looking for pthread.h - found
-- Performing Test CMAKE_HAVE_LIBC_PTHREAD
-- Performing Test CMAKE_HAVE_LIBC_PTHREAD - Failed
-- Looking for pthread_create in pthreads
-- Looking for pthread_create in pthreads - not found
-- Looking for pthread_create in pthread
-- Looking for pthread_create in pthread - found
-- Found Threads: TRUE  
-- Found X11: /usr/include   
-- Looking for XOpenDisplay in /usr/lib/x86_64-linux-gnu/libX11.so;/usr/lib/x86_64-linux-gnu/libXext.so
-- Looking for XOpenDisplay in /usr/lib/x86_64-linux-gnu/libX11.so;/usr/lib/x86_64-linux-gnu/libXext.so - found
-- Looking for gethostbyname
-- Looking for gethostbyname - found
-- Looking for connect
-- Looking for connect - found
-- Looking for remove
-- Looking for remove - found
-- Looking for shmat
-- Looking for shmat - found
-- Looking for IceConnectionNumber in ICE
-- Looking for IceConnectionNumber in ICE - found
-- libudev stable: 1
-- Found UDev: /usr/lib/x86_64-linux-gnu/libudev.so
--    include: /usr/include
-- event-based input enabled. Using /usr/lib/x86_64-linux-gnu/libudev.so
-- Boost version: 1.58.0
-- Found OpenGL: /usr/lib/x86_64-linux-gnu/libGL.so   
-- Found osgText: /home/chris/fg2019_2/install/openscenegraph/lib/libosgText.so  
-- Found osgSim: /home/chris/fg2019_2/install/openscenegraph/lib/libosgSim.so  
-- Found osgDB: /home/chris/fg2019_2/install/openscenegraph/lib/libosgDB.so  
-- Found osgParticle: /home/chris/fg2019_2/install/openscenegraph/lib/libosgParticle.so  
-- Found osgFX: /home/chris/fg2019_2/install/openscenegraph/lib/libosgFX.so  
-- Found osgUtil: /home/chris/fg2019_2/install/openscenegraph/lib/libosgUtil.so  
-- Found osgViewer: /home/chris/fg2019_2/install/openscenegraph/lib/libosgViewer.so  
-- Found osgGA: /home/chris/fg2019_2/install/openscenegraph/lib/libosgGA.so  
-- Found osg: /home/chris/fg2019_2/install/openscenegraph/lib/libosg.so  
-- Found OpenThreads: /home/chris/fg2019_2/install/openscenegraph/lib/libOpenThreads.so  
-- Found OpenSceneGraph: /home/chris/fg2019_2/install/openscenegraph/lib/libosgText.so;/home/chris/fg2019_2/install/openscenegraph/lib/libosgSim.so;/home/chris/fg2019_2/install/openscenegraph/lib/libosgDB.so;/home/chris/fg2019_2/install/openscenegraph/lib/libosgParticle.so;/home/chris/fg2019_2/install/openscenegraph/lib/libosgFX.so;/home/chris/fg2019_2/install/openscenegraph/lib/libosgUtil.so;/home/chris/fg2019_2/install/openscenegraph/lib/libosgViewer.so;/home/chris/fg2019_2/install/openscenegraph/lib/libosgGA.so;/home/chris/fg2019_2/install/openscenegraph/lib/libosg.so;/home/chris/fg2019_2/install/openscenegraph/lib/libOpenThreads.so (found suitable version "3.4.2", minimum required is "3.2.0") 
-- Found PkgConfig: /usr/bin/pkg-config (found version "0.29.1") 
-- Checking for module 'dbus-1'
--   Found dbus-1, version 1.10.6
-- Using DBus
-- Qt launcher enabled, checking for Qt >= 5.4 / qmake
-- Will enable Qt launcher GUI
--   Qt5Widgets version: 5.5.1
--   Qt5Widgets include dir: /usr/include/x86_64-linux-gnu/qt5/;/usr/include/x86_64-linux-gnu/qt5/QtWidgets;/usr/include/x86_64-linux-gnu/qt5/QtGui;/usr/include/x86_64-linux-gnu/qt5/QtCore;/usr/lib/x86_64-linux-gnu/qt5//mkspecs/linux-g++-64;/usr/include
-- Couldn't find translations data, will not include translated string in the executable
-- Could NOT find Qt5LinguistTools (missing: Qt5LinguistTools_DIR)
CMake Warning at CMakeModules/Translations.cmake:18 (find_package):
  Found package configuration file:

    /usr/lib/x86_64-linux-gnu/cmake/Qt5/Qt5Config.cmake

  but it set Qt5_FOUND to FALSE so package "Qt5" is considered to be NOT
  FOUND.  Reason given by package:

  Failed to find Qt5 component "LinguistTools" config file at
  "/usr/lib/x86_64-linux-gnu/cmake/Qt5LinguistTools/Qt5LinguistToolsConfig.cmake"


  

Call Stack (most recent call first):
  CMakeLists.txt:333 (include)


-- /home/chris/fg2019_2/install/plib/include
-- Found PLIB: optimized;/home/chris/fg2019_2/install/plib/lib/libplibpuaux.a;debug;/home/chris/fg2019_2/install/plib/lib/libplibpuaux.a;optimized;/home/chris/fg2019_2/install/plib/lib/libplibpu.a;debug;/home/chris/fg2019_2/install/plib/lib/libplibpu.a;optimized;/home/chris/fg2019_2/install/plib/lib/libplibfnt.a;debug;/home/chris/fg2019_2/install/plib/lib/libplibfnt.a;optimized;/home/chris/fg2019_2/install/plib/lib/libplibsg.a;debug;/home/chris/fg2019_2/install/plib/lib/libplibsg.a;optimized;/home/chris/fg2019_2/install/plib/lib/libplibul.a;debug;/home/chris/fg2019_2/install/plib/lib/libplibul.a  
-- Min Simgear version is 2019.2.0
-- Found ZLIB: /usr/lib/x86_64-linux-gnu/libz.so (found version "1.2.8") 
-- Looking for unistd.h
-- Looking for unistd.h - found
-- Looking for sys/time.h
-- Looking for sys/time.h - found
-- Looking for sys/timeb.h
-- Looking for sys/timeb.h - found
-- Looking for windows.h
-- Looking for windows.h - not found
-- Looking for timegm
-- Looking for timegm - found
-- Looking for daylight
-- Looking for daylight - found
-- Looking for ftime
-- Looking for ftime - found
-- Looking for gettimeofday
-- Looking for gettimeofday - found
-- RTI: DISABLED
-- OpenMP: DISABLED
-- SSE/SSE2 support: ENABLED
-- Looking for mkfifo
-- Looking for mkfifo - found
-- Enabling legacy joystick code (from PLIB)
-- Found PNG: /usr/lib/x86_64-linux-gnu/libpng.so (found version "1.2.54") 
-- Found GLEW: /usr/include (found version "1.13.0") 
-- Found Freetype: /usr/lib/x86_64-linux-gnu/libfreetype.so  
-- Found GLUT: /usr/lib/x86_64-linux-gnu/libglut.a  
-- found GLUT inc /usr/include, lib /usr/lib/x86_64-linux-gnu/libglut.a;/usr/lib/x86_64-linux-gnu/libXmu.a;/usr/lib/x86_64-linux-gnu/libXi.a 
-- Found OpenAL: /usr/lib/x86_64-linux-gnu/libopenal.so  
-- CppUnit: Building the FlightGear supplied CppUnit library
-- Configuring done
-- Generating done
-- Build files have been written to: /home/chris/fg2019_2/build/flightgear
MAKE flightgear
Scanning dependencies of target fgtraffic
[  0%] Building CXX object utils/traffic/CMakeFiles/fgtraffic.dir/fgtraffic.cxx.o
Scanning dependencies of target fgelev
[  0%] Building CXX object utils/fgelev/CMakeFiles/fgelev.dir/fgelev.cxx.o
Scanning dependencies of target PLIBJoystick
[  0%] Building CXX object 3rdparty/joystick/CMakeFiles/PLIBJoystick.dir/js.cxx.o
Scanning dependencies of target hts_engine
Scanning dependencies of target MIDGsmooth
[  0%] Building C object 3rdparty/hts_engine_API/CMakeFiles/hts_engine.dir/lib/HTS_audio.c.o
Scanning dependencies of target GPSsmooth
[  1%] Building CXX object utils/GPSsmooth/CMakeFiles/MIDGsmooth.dir/MIDG-II.cxx.o
[  1%] Building CXX object utils/GPSsmooth/CMakeFiles/GPSsmooth.dir/GPSsmooth.cxx.o
Scanning dependencies of target UGsmooth
[  1%] Building CXX object utils/GPSsmooth/CMakeFiles/UGsmooth.dir/UGear.cxx.o
Scanning dependencies of target fgsqlite3
[  1%] Building C object 3rdparty/sqlite3/CMakeFiles/fgsqlite3.dir/sqlite3.c.o
Scanning dependencies of target fgviewer
[  1%] Building C object 3rdparty/hts_engine_API/CMakeFiles/hts_engine.dir/lib/HTS_engine.c.o
[  1%] Linking CXX executable fgtraffic
[  1%] Building CXX object utils/fgviewer/CMakeFiles/fgviewer.dir/fgviewer.cxx.o
Scanning dependencies of target fgpanel
[  1%] Building CXX object utils/fgpanel/CMakeFiles/fgpanel.dir/main.cxx.o
Scanning dependencies of target flite_hts
[  1%] Building C object 3rdparty/flite_hts_engine/CMakeFiles/flite_hts.dir/flite/src/hrg/cst_ffeature.c.o
[  1%] Built target fgtraffic
Scanning dependencies of target iaxclient_lib
Scanning dependencies of target fgrcc
[  1%] Building C object 3rdparty/iaxclient/lib/CMakeFiles/iaxclient_lib.dir/audio_encode.c.o
[  1%] Building CXX object src/EmbeddedResources/CMakeFiles/fgrcc.dir/fgrcc.cxx.o
[  1%] Building CXX object 3rdparty/joystick/CMakeFiles/PLIBJoystick.dir/jsLinux.cxx.o
[  1%] Building C object 3rdparty/flite_hts_engine/CMakeFiles/flite_hts.dir/flite/src/hrg/cst_item.c.o
[  1%] Building C object 3rdparty/iaxclient/lib/CMakeFiles/iaxclient_lib.dir/audio_file.c.o
[  1%] Building C object 3rdparty/hts_engine_API/CMakeFiles/hts_engine.dir/lib/HTS_gstream.c.o
[  1%] Building C object 3rdparty/flite_hts_engine/CMakeFiles/flite_hts.dir/flite/src/hrg/cst_relation.c.o
[  1%] Building C object 3rdparty/iaxclient/lib/CMakeFiles/iaxclient_lib.dir/audio_openal.c.o
[  1%] Building C object 3rdparty/flite_hts_engine/CMakeFiles/flite_hts.dir/flite/src/hrg/cst_utterance.c.o
[  1%] Building C object 3rdparty/hts_engine_API/CMakeFiles/hts_engine.dir/lib/HTS_label.c.o
[  1%] Building C object 3rdparty/flite_hts_engine/CMakeFiles/flite_hts.dir/flite/src/lexicon/cst_lexicon.c.o
[  3%] Building C object 3rdparty/iaxclient/lib/CMakeFiles/iaxclient_lib.dir/codec_alaw.c.o
[  3%] Building C object 3rdparty/hts_engine_API/CMakeFiles/hts_engine.dir/lib/HTS_misc.c.o
/home/chris/fg2019_2/flightgear/3rdparty/flite_hts_engine/flite/src/lexicon/cst_lexicon.c:93:12: warning: ‘no_syl_boundaries’ declared ‘static’ but never defined [-Wunused-function]
 static int no_syl_boundaries(const cst_item *i, const cst_val *p);
            ^
[  3%] Building C object 3rdparty/iaxclient/lib/CMakeFiles/iaxclient_lib.dir/codec_gsm.c.o
[  3%] Building C object 3rdparty/flite_hts_engine/CMakeFiles/flite_hts.dir/flite/src/lexicon/cst_lts.c.o
[  3%] Building CXX object utils/GPSsmooth/CMakeFiles/GPSsmooth.dir/gps_main.cxx.o
[  3%] Building C object 3rdparty/iaxclient/lib/CMakeFiles/iaxclient_lib.dir/codec_ulaw.c.o
[  3%] Linking CXX static library libPLIBJoystick.a
[  3%] Building C object 3rdparty/hts_engine_API/CMakeFiles/hts_engine.dir/lib/HTS_model.c.o
[  3%] Building C object 3rdparty/flite_hts_engine/CMakeFiles/flite_hts.dir/flite/src/regex/cst_regex.c.o
[  3%] Built target PLIBJoystick
Scanning dependencies of target fgqmlui_autogen
[  3%] Automatic MOC for target fgqmlui
[  3%] Building C object 3rdparty/flite_hts_engine/CMakeFiles/flite_hts.dir/flite/src/regex/regexp.c.o
[  3%] Building CXX object utils/fgpanel/CMakeFiles/fgpanel.dir/ApplicationProperties.cxx.o
[  3%] Building CXX object utils/GPSsmooth/CMakeFiles/MIDGsmooth.dir/MIDG_main.cxx.o
[  3%] Building C object 3rdparty/iaxclient/lib/CMakeFiles/iaxclient_lib.dir/iaxclient_lib.c.o
[  3%] Building C object 3rdparty/flite_hts_engine/CMakeFiles/flite_hts.dir/flite/src/stats/cst_cart.c.o
[  3%] Building C object 3rdparty/flite_hts_engine/CMakeFiles/flite_hts.dir/flite/src/synth/cst_ffeatures.c.o
[  3%] Building C object 3rdparty/iaxclient/lib/CMakeFiles/iaxclient_lib.dir/unixfuncs.c.o
[  3%] Building CXX object utils/fgpanel/CMakeFiles/fgpanel.dir/FGCroppedTexture.cxx.o
[  3%] Building C object 3rdparty/iaxclient/lib/CMakeFiles/iaxclient_lib.dir/codec_speex.c.o
[  3%] Building C object 3rdparty/flite_hts_engine/CMakeFiles/flite_hts.dir/flite/src/synth/cst_phoneset.c.o
[  3%] Building C object 3rdparty/flite_hts_engine/CMakeFiles/flite_hts.dir/flite/src/synth/cst_synth.c.o
[  3%] Building C object 3rdparty/iaxclient/lib/CMakeFiles/iaxclient_lib.dir/spandsp/plc.c.o
/home/chris/fg2019_2/flightgear/3rdparty/flite_hts_engine/flite/src/synth/cst_synth.c:108:23: warning: ‘tokentosegs’ declared ‘static’ but never defined [-Wunused-function]
 static cst_utterance *tokentosegs(cst_utterance *u);
                       ^
[  3%] Building C object 3rdparty/hts_engine_API/CMakeFiles/hts_engine.dir/lib/HTS_pstream.c.o
[  3%] Building CXX object utils/GPSsmooth/CMakeFiles/UGsmooth.dir/UGear_command.cxx.o
[  3%] Building C object 3rdparty/iaxclient/lib/CMakeFiles/iaxclient_lib.dir/gsm/src/add.c.o
[  3%] Building C object 3rdparty/flite_hts_engine/CMakeFiles/flite_hts.dir/flite/src/synth/cst_utt_utils.c.o
[  3%] Building C object 3rdparty/iaxclient/lib/CMakeFiles/iaxclient_lib.dir/gsm/src/code.c.o
[  3%] Building C object 3rdparty/flite_hts_engine/CMakeFiles/flite_hts.dir/flite/src/synth/cst_voice.c.o
[  3%] Building C object 3rdparty/iaxclient/lib/CMakeFiles/iaxclient_lib.dir/gsm/src/debug.c.o
[  5%] Building C object 3rdparty/flite_hts_engine/CMakeFiles/flite_hts.dir/flite/src/synth/flite.c.o
[  5%] Building C object 3rdparty/iaxclient/lib/CMakeFiles/iaxclient_lib.dir/gsm/src/decode.c.o
[  5%] Building C object 3rdparty/flite_hts_engine/CMakeFiles/flite_hts.dir/flite/src/utils/cst_alloc.c.o
[  5%] Building C object 3rdparty/iaxclient/lib/CMakeFiles/iaxclient_lib.dir/gsm/src/gsm_create.c.o
[  5%] Building C object 3rdparty/hts_engine_API/CMakeFiles/hts_engine.dir/lib/HTS_sstream.c.o
[  5%] Building C object 3rdparty/iaxclient/lib/CMakeFiles/iaxclient_lib.dir/gsm/src/gsm_decode.c.o
[  5%] Building C object 3rdparty/flite_hts_engine/CMakeFiles/flite_hts.dir/flite/src/utils/cst_error.c.o
[  5%] Building C object 3rdparty/flite_hts_engine/CMakeFiles/flite_hts.dir/flite/src/utils/cst_features.c.o
[  5%] Building C object 3rdparty/iaxclient/lib/CMakeFiles/iaxclient_lib.dir/gsm/src/gsm_destroy.c.o
[  5%] Linking CXX executable GPSsmooth
[  5%] Building C object 3rdparty/flite_hts_engine/CMakeFiles/flite_hts.dir/flite/src/utils/cst_string.c.o
[  5%] Building C object 3rdparty/hts_engine_API/CMakeFiles/hts_engine.dir/lib/HTS_vocoder.c.o
[  5%] Building C object 3rdparty/iaxclient/lib/CMakeFiles/iaxclient_lib.dir/gsm/src/gsm_encode.c.o
[  5%] Building CXX object utils/GPSsmooth/CMakeFiles/UGsmooth.dir/UGear_telnet.cxx.o
[  5%] Linking CXX executable MIDGsmooth
[  5%] Building C object 3rdparty/flite_hts_engine/CMakeFiles/flite_hts.dir/flite/src/utils/cst_tokenstream.c.o
/home/chris/fg2019_2/flightgear/3rdparty/flite_hts_engine/flite/src/utils/cst_tokenstream.c: In function ‘ts_get_quoted_token’:
/home/chris/fg2019_2/flightgear/3rdparty/flite_hts_engine/flite/src/utils/cst_tokenstream.c:386:9: warning: variable ‘l’ set but not used [-Wunused-but-set-variable]
     int l, p;
         ^
[  5%] Built target GPSsmooth
Scanning dependencies of target fglauncher_autogen
[  6%] Building C object 3rdparty/iaxclient/lib/CMakeFiles/iaxclient_lib.dir/gsm/src/gsm_explode.c.o
[  6%] Generating ui_SetupRootDialog.h
[  6%] Generating qrc_resources.cpp
/home/chris/fg2019_2/flightgear/3rdparty/flite_hts_engine/flite/src/utils/cst_tokenstream.c: In function ‘ts_set_stream_pos’:
/home/chris/fg2019_2/flightgear/3rdparty/flite_hts_engine/flite/src/utils/cst_tokenstream.c:349:12: warning: ‘new_pos’ may be used uninitialized in this function [-Wmaybe-uninitialized]
     return ts->file_pos;
            ^
[  6%] Built target MIDGsmooth
[  6%] Building C object 3rdparty/iaxclient/lib/CMakeFiles/iaxclient_lib.dir/gsm/src/gsm_implode.c.o
[  6%] Building C object 3rdparty/flite_hts_engine/CMakeFiles/flite_hts.dir/flite/src/utils/cst_val.c.o
Scanning dependencies of target fgjs
[  6%] Building CXX object src/Input/CMakeFiles/fgjs.dir/fgjs.cxx.o
[  6%] Generating ui_InstallSceneryDialog.h
[  6%] Building CXX object utils/fgpanel/CMakeFiles/fgpanel.dir/FGDummyTextureLoader.cxx.o
/home/chris/fg2019_2/flightgear/3rdparty/flite_hts_engine/flite/src/utils/cst_val.c: In function ‘cst_utf8_explode’:
/home/chris/fg2019_2/flightgear/3rdparty/flite_hts_engine/flite/src/utils/cst_val.c:520:12: warning: variable ‘l’ set but not used [-Wunused-but-set-variable]
     int i, l=0;
            ^
[  8%] Automatic MOC for target fglauncher
[  8%] Building C object 3rdparty/iaxclient/lib/CMakeFiles/iaxclient_lib.dir/gsm/src/gsm_option.c.o
[  8%] Building C object 3rdparty/iaxclient/lib/CMakeFiles/iaxclient_lib.dir/gsm/src/gsm_print.c.o
[  8%] Linking C static library libhts_engine.a
[  8%] Building C object 3rdparty/flite_hts_engine/CMakeFiles/flite_hts.dir/flite/src/utils/cst_val_const.c.o
[  8%] Building C object 3rdparty/iaxclient/lib/CMakeFiles/iaxclient_lib.dir/gsm/src/long_term.c.o
[  8%] Built target hts_engine
Scanning dependencies of target js_demo
[  8%] Building CXX object utils/fgpanel/CMakeFiles/fgpanel.dir/FGFontCache.cxx.o
[  8%] Building CXX object src/Input/CMakeFiles/js_demo.dir/js_demo.cxx.o
[  8%] Building C object 3rdparty/flite_hts_engine/CMakeFiles/flite_hts.dir/flite/src/utils/cst_val_user.c.o
[  8%] Building C object 3rdparty/flite_hts_engine/CMakeFiles/flite_hts.dir/flite/lang/cmu_us_kal/cmu_us_kal.c.o
[  8%] Building C object 3rdparty/iaxclient/lib/CMakeFiles/iaxclient_lib.dir/gsm/src/lpc.c.o
[  8%] Building C object 3rdparty/flite_hts_engine/CMakeFiles/flite_hts.dir/flite/lang/cmulex/cmu_lex.c.o
/home/chris/fg2019_2/flightgear/3rdparty/flite_hts_engine/flite/lang/cmulex/cmu_lex.c: In function ‘cmu_lex_init’:
/home/chris/fg2019_2/flightgear/3rdparty/flite_hts_engine/flite/lang/cmulex/cmu_lex.c:359:18: warning: assignment discards ‘const’ qualifier from pointer target type [-Wdiscarded-qualifiers]
     cmu_lex.data = cmu_lex_data;
                  ^
[  8%] Linking CXX executable js_demo
[  8%] Building C object 3rdparty/flite_hts_engine/CMakeFiles/flite_hts.dir/flite/lang/cmulex/cmu_lex_data.c.o
[  8%] Building CXX object utils/GPSsmooth/CMakeFiles/UGsmooth.dir/UGear_main.cxx.o
[  8%] Building C object 3rdparty/iaxclient/lib/CMakeFiles/iaxclient_lib.dir/gsm/src/preprocess.c.o
[  8%] Building C object 3rdparty/iaxclient/lib/CMakeFiles/iaxclient_lib.dir/gsm/src/rpe.c.o
[  8%] Built target js_demo
Scanning dependencies of target yasim-proptest
[  8%] Building CXX object src/FDM/YASim/CMakeFiles/yasim-proptest.dir/proptest.cpp.o
[  8%] Building C object 3rdparty/iaxclient/lib/CMakeFiles/iaxclient_lib.dir/gsm/src/short_term.c.o
[  8%] Building C object 3rdparty/iaxclient/lib/CMakeFiles/iaxclient_lib.dir/gsm/src/table.c.o
[  8%] Building C object 3rdparty/iaxclient/lib/CMakeFiles/iaxclient_lib.dir/libspeex/bits.c.o
[  8%] Building C object 3rdparty/iaxclient/lib/CMakeFiles/iaxclient_lib.dir/libspeex/cb_search.c.o
[  8%] Linking CXX executable fgrcc
[  8%] Built target fgqmlui_autogen
[  8%] Built target fgrcc
[  8%] Building C object 3rdparty/iaxclient/lib/CMakeFiles/iaxclient_lib.dir/libspeex/exc_10_16_table.c.o
[  8%] Building C object 3rdparty/iaxclient/lib/CMakeFiles/iaxclient_lib.dir/libspeex/exc_10_32_table.c.o
[  8%] Building C object 3rdparty/iaxclient/lib/CMakeFiles/iaxclient_lib.dir/libspeex/exc_20_32_table.c.o
Scanning dependencies of target yasim
[  8%] Building CXX object src/FDM/YASim/CMakeFiles/yasim.dir/yasim-test.cpp.o
[ 10%] Building C object 3rdparty/iaxclient/lib/CMakeFiles/iaxclient_lib.dir/libspeex/exc_5_256_table.c.o
[ 10%] Building CXX object src/Input/CMakeFiles/fgjs.dir/jsinput.cxx.o
[ 10%] Building C object 3rdparty/iaxclient/lib/CMakeFiles/iaxclient_lib.dir/libspeex/exc_5_64_table.c.o
[ 10%] Building C object 3rdparty/iaxclient/lib/CMakeFiles/iaxclient_lib.dir/libspeex/exc_8_128_table.c.o
[ 10%] Building CXX object utils/fgpanel/CMakeFiles/fgpanel.dir/FGGLApplication.cxx.o
[ 10%] Building C object 3rdparty/flite_hts_engine/CMakeFiles/flite_hts.dir/flite/lang/cmulex/cmu_lex_entries.c.o
[ 10%] Building C object 3rdparty/iaxclient/lib/CMakeFiles/iaxclient_lib.dir/libspeex/filters.c.o
[ 10%] Building C object 3rdparty/flite_hts_engine/CMakeFiles/flite_hts.dir/flite/lang/cmulex/cmu_lts_model.c.o
[ 10%] Building C object 3rdparty/iaxclient/lib/CMakeFiles/iaxclient_lib.dir/libspeex/gain_table.c.o
[ 10%] Building C object 3rdparty/iaxclient/lib/CMakeFiles/iaxclient_lib.dir/libspeex/gain_table_lbr.c.o
[ 10%] Building C object 3rdparty/iaxclient/lib/CMakeFiles/iaxclient_lib.dir/libspeex/hexc_10_32_table.c.o
[ 10%] Building CXX object utils/fgviewer/CMakeFiles/fgviewer.dir/Drawable.cxx.o
[ 10%] Building C object 3rdparty/iaxclient/lib/CMakeFiles/iaxclient_lib.dir/libspeex/hexc_table.c.o
[ 10%] Building C object 3rdparty/iaxclient/lib/CMakeFiles/iaxclient_lib.dir/libspeex/high_lsp_tables.c.o
In file included from /home/chris/fg2019_2/flightgear/src/FDM/YASim/proptest.cpp:8:0:
/home/chris/fg2019_2/flightgear/src/FDM/YASim/yasim-common.hpp:41:24: warning: ‘yasim::DEF_PROP_ELEVATOR_TRIM’ defined but not used [-Wunused-variable]
     static const char* DEF_PROP_ELEVATOR_TRIM = "/controls/flight/elevator-trim";
                        ^
[ 10%] Building CXX object src/Input/CMakeFiles/fgjs.dir/jssuper.cxx.o
[ 10%] Building C object 3rdparty/iaxclient/lib/CMakeFiles/iaxclient_lib.dir/libspeex/jitter.c.o
[ 10%] Building CXX object src/FDM/YASim/CMakeFiles/yasim-proptest.dir/Airplane.cpp.o
[ 10%] Building CXX object utils/fgpanel/CMakeFiles/fgpanel.dir/FGGroupLayer.cxx.o
[ 10%] Building C object 3rdparty/iaxclient/lib/CMakeFiles/iaxclient_lib.dir/libspeex/lbr_48k_tables.c.o
[ 10%] Linking CXX executable fgelev
[ 11%] Building C object 3rdparty/flite_hts_engine/CMakeFiles/flite_hts.dir/flite/lang/cmulex/cmu_lts_rules.c.o
[ 11%] Building C object 3rdparty/iaxclient/lib/CMakeFiles/iaxclient_lib.dir/libspeex/lpc.c.o
[ 11%] Building C object 3rdparty/flite_hts_engine/CMakeFiles/flite_hts.dir/flite/lang/cmulex/cmu_postlex.c.o
[ 11%] Building C object 3rdparty/iaxclient/lib/CMakeFiles/iaxclient_lib.dir/libspeex/lsp.c.o
[ 11%] Building C object 3rdparty/flite_hts_engine/CMakeFiles/flite_hts.dir/flite/lang/usenglish/us_aswd.c.o
[ 11%] Linking CXX executable fgjs
[ 11%] Building C object 3rdparty/iaxclient/lib/CMakeFiles/iaxclient_lib.dir/libspeex/lsp_tables_nb.c.o
[ 11%] Building C object 3rdparty/flite_hts_engine/CMakeFiles/flite_hts.dir/flite/lang/usenglish/us_expand.c.o
[ 13%] Building C object 3rdparty/iaxclient/lib/CMakeFiles/iaxclient_lib.dir/libspeex/ltp.c.o
[ 13%] Built target fgjs
[ 13%] Building C object 3rdparty/iaxclient/lib/CMakeFiles/iaxclient_lib.dir/libspeex/math_approx.c.o
[ 13%] Building C object 3rdparty/iaxclient/lib/CMakeFiles/iaxclient_lib.dir/libspeex/mdf.c.o
[ 13%] Building C object 3rdparty/flite_hts_engine/CMakeFiles/flite_hts.dir/flite/lang/usenglish/us_ffeatures.c.o
[ 13%] Building CXX object utils/fgpanel/CMakeFiles/fgpanel.dir/FGInstrumentLayer.cxx.o
[ 13%] Building C object 3rdparty/iaxclient/lib/CMakeFiles/iaxclient_lib.dir/libspeex/medfilter.c.o
[ 13%] Linking CXX executable UGsmooth
[ 13%] Building C object 3rdparty/iaxclient/lib/CMakeFiles/iaxclient_lib.dir/libspeex/misc.c.o
[ 13%] Building C object 3rdparty/iaxclient/lib/CMakeFiles/iaxclient_lib.dir/libspeex/modes.c.o
[ 13%] Building CXX object src/FDM/YASim/CMakeFiles/yasim.dir/Airplane.cpp.o
[ 13%] Building C object 3rdparty/flite_hts_engine/CMakeFiles/flite_hts.dir/flite/lang/usenglish/us_gpos.c.o
[ 13%] Building C object 3rdparty/iaxclient/lib/CMakeFiles/iaxclient_lib.dir/libspeex/nb_celp.c.o
[ 13%] Built target UGsmooth
[ 13%] Building C object 3rdparty/iaxclient/lib/CMakeFiles/iaxclient_lib.dir/libspeex/preprocess.c.o
[ 13%] Building C object 3rdparty/flite_hts_engine/CMakeFiles/flite_hts.dir/flite/lang/usenglish/us_int_accent_cart.c.o
[ 13%] Building C object 3rdparty/flite_hts_engine/CMakeFiles/flite_hts.dir/flite/lang/usenglish/us_int_tone_cart.c.o
[ 13%] Building C object 3rdparty/flite_hts_engine/CMakeFiles/flite_hts.dir/flite/lang/usenglish/us_nums_cart.c.o
[ 13%] Building C object 3rdparty/flite_hts_engine/CMakeFiles/flite_hts.dir/flite/lang/usenglish/us_phoneset.c.o
[ 13%] Building C object 3rdparty/flite_hts_engine/CMakeFiles/flite_hts.dir/flite/lang/usenglish/us_phrasing_cart.c.o
[ 13%] Building C object 3rdparty/flite_hts_engine/CMakeFiles/flite_hts.dir/flite/lang/usenglish/us_pos_cart.c.o
[ 13%] Building C object 3rdparty/flite_hts_engine/CMakeFiles/flite_hts.dir/flite/lang/usenglish/us_text.c.o
[ 13%] Building C object 3rdparty/iaxclient/lib/CMakeFiles/iaxclient_lib.dir/libspeex/quant_lsp.c.o
[ 13%] Building CXX object utils/fgpanel/CMakeFiles/fgpanel.dir/FGLayeredInstrument.cxx.o
[ 13%] Building C object 3rdparty/iaxclient/lib/CMakeFiles/iaxclient_lib.dir/libspeex/sb_celp.c.o
[ 13%] Building C object 3rdparty/iaxclient/lib/CMakeFiles/iaxclient_lib.dir/libspeex/smallft.c.o
[ 13%] Building C object 3rdparty/flite_hts_engine/CMakeFiles/flite_hts.dir/flite/lang/usenglish/usenglish.c.o
Scanning dependencies of target JSBSim
[ 13%] Building CXX object src/FDM/JSBSim/CMakeFiles/JSBSim.dir/FGFDMExec.cpp.o
[ 13%] Building C object 3rdparty/flite_hts_engine/CMakeFiles/flite_hts.dir/lib/flite_hts_engine.c.o
[ 13%] Built target fgelev
Scanning dependencies of target metar
[ 13%] Built target fglauncher_autogen
[ 13%] Building CXX object src/Main/CMakeFiles/metar.dir/metar_main.cxx.o
Scanning dependencies of target buildId
[ 13%] Building CXX object utils/fgviewer/CMakeFiles/fgviewer.dir/Renderer.cxx.o
-- Found Git: /usr/bin/git (found version "2.7.4") 
-- Git revision is b9dc64ab87d08de7457ddff11f2a074c135f0717
[ 15%] Linking C static library libflite_hts.a
[ 15%] Built target buildId
[ 15%] Building CXX object src/FDM/YASim/CMakeFiles/yasim-proptest.dir/Atmosphere.cpp.o
[ 15%] Built target flite_hts
[ 15%] Building C object 3rdparty/iaxclient/lib/CMakeFiles/iaxclient_lib.dir/libspeex/speex.c.o
[ 15%] Building C object 3rdparty/iaxclient/lib/CMakeFiles/iaxclient_lib.dir/libspeex/speex_callbacks.c.o
[ 15%] Building C object 3rdparty/iaxclient/lib/CMakeFiles/iaxclient_lib.dir/libspeex/speex_header.c.o
[ 15%] Building CXX object utils/fgpanel/CMakeFiles/fgpanel.dir/FGPanel.cxx.o
[ 15%] Building C object 3rdparty/iaxclient/lib/CMakeFiles/iaxclient_lib.dir/libspeex/stereo.c.o
[ 15%] Building CXX object src/FDM/YASim/CMakeFiles/yasim-proptest.dir/ControlMap.cpp.o
[ 16%] Building C object 3rdparty/iaxclient/lib/CMakeFiles/iaxclient_lib.dir/libspeex/vbr.c.o
Scanning dependencies of target fgqmlui
[ 16%] Building CXX object src/GUI/CMakeFiles/fgqmlui.dir/fgqmlui_autogen/mocs_compilation.cpp.o
[ 16%] Building C object 3rdparty/iaxclient/lib/CMakeFiles/iaxclient_lib.dir/libspeex/vq.c.o
[ 16%] Building C object 3rdparty/iaxclient/lib/CMakeFiles/iaxclient_lib.dir/libiax2/src/iax.c.o
Scanning dependencies of target fglauncher
/home/chris/fg2019_2/flightgear/3rdparty/iaxclient/lib/libiax2/src/iax.c: In function ‘iax_transfer’:
/home/chris/fg2019_2/flightgear/3rdparty/iaxclient/lib/libiax2/src/iax.c:1354:13: warning: variable ‘res’ set but not used [-Wunused-but-set-variable]
  static int res;    //Return Code
             ^
[ 16%] Building C object 3rdparty/iaxclient/lib/CMakeFiles/iaxclient_lib.dir/libiax2/src/iax2-parser.c.o
[ 16%] Building CXX object src/GUI/CMakeFiles/fglauncher.dir/fglauncher_autogen/mocs_compilation.cpp.o
[ 16%] Building C object 3rdparty/iaxclient/lib/CMakeFiles/iaxclient_lib.dir/libiax2/src/jitterbuf.c.o
[ 16%] Building CXX object src/FDM/YASim/CMakeFiles/yasim.dir/Atmosphere.cpp.o
[ 16%] Building C object 3rdparty/iaxclient/lib/CMakeFiles/iaxclient_lib.dir/libiax2/src/md5.c.o
[ 16%] Building CXX object src/FDM/YASim/CMakeFiles/yasim.dir/ControlMap.cpp.o
[ 16%] Building CXX object src/FDM/YASim/CMakeFiles/yasim.dir/FGFDM.cpp.o
[ 16%] Linking C static library libiaxclient_lib.a
[ 16%] Built target iaxclient_lib
Scanning dependencies of target fgcom
[ 16%] Building CXX object utils/fgcom/CMakeFiles/fgcom.dir/fgcom.cxx.o
[ 18%] Building CXX object utils/fgpanel/CMakeFiles/fgpanel.dir/FGPanelApplication.cxx.o
In file included from /home/chris/fg2019_2/flightgear/src/FDM/YASim/Wing.hpp:4:0,
                 from /home/chris/fg2019_2/flightgear/src/FDM/YASim/ControlMap.cpp:15:
/home/chris/fg2019_2/flightgear/src/FDM/YASim/yasim-common.hpp:41:24: warning: ‘yasim::DEF_PROP_ELEVATOR_TRIM’ defined but not used [-Wunused-variable]
     static const char* DEF_PROP_ELEVATOR_TRIM = "/controls/flight/elevator-trim";
                        ^
[ 18%] Building CXX object src/FDM/YASim/CMakeFiles/yasim-proptest.dir/FGFDM.cpp.o
[ 18%] Building CXX object utils/fgviewer/CMakeFiles/fgviewer.dir/SlaveCamera.cxx.o
[ 18%] Building CXX object utils/fgpanel/CMakeFiles/fgpanel.dir/FGPanelInstrument.cxx.o
In file included from /home/chris/fg2019_2/flightgear/src/FDM/YASim/Wing.hpp:4:0,
                 from /home/chris/fg2019_2/flightgear/src/FDM/YASim/ControlMap.cpp:15:
/home/chris/fg2019_2/flightgear/src/FDM/YASim/yasim-common.hpp:41:24: warning: ‘yasim::DEF_PROP_ELEVATOR_TRIM’ defined but not used [-Wunused-variable]
     static const char* DEF_PROP_ELEVATOR_TRIM = "/controls/flight/elevator-trim";
                        ^
[ 18%] Building CXX object utils/fgpanel/CMakeFiles/fgpanel.dir/FGPanelProtocol.cxx.o
[ 18%] Building CXX object src/FDM/YASim/CMakeFiles/yasim.dir/Gear.cpp.o
[ 18%] Linking CXX executable metar
[ 18%] Built target metar
[ 18%] Building CXX object src/FDM/YASim/CMakeFiles/yasim.dir/Glue.cpp.o
[ 18%] Building CXX object utils/fgpanel/CMakeFiles/fgpanel.dir/FGPanelTransformation.cxx.o
[ 18%] Building CXX object src/FDM/YASim/CMakeFiles/yasim.dir/Ground.cpp.o
In file included from /home/chris/fg2019_2/flightgear/src/FDM/YASim/FGFDM.cpp:11:0:
/home/chris/fg2019_2/flightgear/src/FDM/YASim/yasim-common.hpp:41:24: warning: ‘yasim::DEF_PROP_ELEVATOR_TRIM’ defined but not used [-Wunused-variable]
     static const char* DEF_PROP_ELEVATOR_TRIM = "/controls/flight/elevator-trim";
                        ^
[ 18%] Building CXX object utils/fgpanel/CMakeFiles/fgpanel.dir/FGPNGTextureLoader.cxx.o
[ 18%] Building CXX object src/FDM/YASim/CMakeFiles/yasim.dir/Hitch.cpp.o
[ 18%] Building CXX object utils/fgviewer/CMakeFiles/fgviewer.dir/Viewer.cxx.o
[ 18%] Building CXX object src/FDM/YASim/CMakeFiles/yasim.dir/Hook.cpp.o
[ 18%] Building CXX object src/FDM/JSBSim/CMakeFiles/JSBSim.dir/FGJSBBase.cpp.o
[ 18%] Building CXX object src/FDM/YASim/CMakeFiles/yasim.dir/Integrator.cpp.o
/home/chris/fg2019_2/flightgear/utils/fgpanel/FGPNGTextureLoader.cxx: In member function ‘virtual GLuint FGPNGTextureLoader::loadTexture(const string&)’:
/home/chris/fg2019_2/flightgear/utils/fgpanel/FGPNGTextureLoader.cxx:56:27: warning: ignoring return value of ‘size_t fread(void*, size_t, size_t, FILE*)’, declared with attribute warn_unused_result [-Wunused-result]
   fread (header, 1, 8, fp);
                           ^
[ 18%] Building CXX object utils/fgpanel/CMakeFiles/fgpanel.dir/FGRGBTextureLoader.cxx.o
[ 18%] Building CXX object src/FDM/YASim/CMakeFiles/yasim.dir/Jet.cpp.o
[ 20%] Building CXX object src/FDM/YASim/CMakeFiles/yasim.dir/Launchbar.cpp.o
In file included from /home/chris/fg2019_2/flightgear/src/FDM/YASim/FGFDM.cpp:11:0:
/home/chris/fg2019_2/flightgear/src/FDM/YASim/yasim-common.hpp:41:24: warning: ‘yasim::DEF_PROP_ELEVATOR_TRIM’ defined but not used [-Wunused-variable]
     static const char* DEF_PROP_ELEVATOR_TRIM = "/controls/flight/elevator-trim";
                        ^
[ 20%] Building CXX object src/FDM/YASim/CMakeFiles/yasim.dir/Model.cpp.o
[ 20%] Building CXX object src/FDM/YASim/CMakeFiles/yasim-proptest.dir/Gear.cpp.o
[ 20%] Building CXX object utils/fgpanel/CMakeFiles/fgpanel.dir/FGSwitchLayer.cxx.o
[ 20%] Building CXX object src/FDM/YASim/CMakeFiles/yasim.dir/PistonEngine.cpp.o
[ 20%] Building CXX object utils/fgpanel/CMakeFiles/fgpanel.dir/FGTextLayer.cxx.o
[ 20%] Building CXX object src/FDM/YASim/CMakeFiles/yasim.dir/PropEngine.cpp.o
[ 20%] Building CXX object src/FDM/JSBSim/CMakeFiles/JSBSim.dir/JSBSim.cxx.o
[ 20%] Building CXX object src/FDM/YASim/CMakeFiles/yasim.dir/Propeller.cpp.o
[ 20%] Linking CXX executable fgcom
[ 20%] Building CXX object src/GUI/CMakeFiles/fglauncher.dir/QtLauncher.cxx.o
[ 20%] Building CXX object src/FDM/YASim/CMakeFiles/yasim.dir/RigidBody.cpp.o
[ 20%] Built target fgcom
[ 20%] Building CXX object src/FDM/YASim/CMakeFiles/yasim.dir/Rotor.cpp.o
[ 20%] Building CXX object src/FDM/YASim/CMakeFiles/yasim.dir/Rotorpart.cpp.o
In file included from /home/chris/fg2019_2/flightgear/src/FDM/YASim/Version.hpp:4:0,
                 from /home/chris/fg2019_2/flightgear/src/FDM/YASim/Surface.hpp:5,
                 from /home/chris/fg2019_2/flightgear/src/FDM/YASim/Model.cpp:16:
/home/chris/fg2019_2/flightgear/src/FDM/YASim/yasim-common.hpp:41:24: warning: ‘yasim::DEF_PROP_ELEVATOR_TRIM’ defined but not used [-Wunused-variable]
     static const char* DEF_PROP_ELEVATOR_TRIM = "/controls/flight/elevator-trim";
                        ^
[ 20%] Building CXX object src/FDM/YASim/CMakeFiles/yasim.dir/SimpleJet.cpp.o
[ 20%] Building CXX object src/FDM/YASim/CMakeFiles/yasim.dir/Surface.cpp.o
[ 20%] Building CXX object src/FDM/YASim/CMakeFiles/yasim-proptest.dir/Glue.cpp.o
[ 20%] Building CXX object src/FDM/YASim/CMakeFiles/yasim.dir/TurbineEngine.cpp.o
[ 20%] Building CXX object utils/fgpanel/CMakeFiles/fgpanel.dir/FGTexturedLayer.cxx.o
[ 20%] Building CXX object src/FDM/YASim/CMakeFiles/yasim.dir/Turbulence.cpp.o
[ 20%] Building CXX object src/FDM/YASim/CMakeFiles/yasim.dir/Wing.cpp.o
[ 20%] Building CXX object src/FDM/YASim/CMakeFiles/yasim.dir/Version.cpp.o
[ 20%] Building CXX object src/FDM/YASim/CMakeFiles/yasim-proptest.dir/Ground.cpp.o
[ 21%] Building CXX object src/FDM/YASim/CMakeFiles/yasim.dir/yasim-common.cpp.o
[ 21%] Building CXX object utils/fgpanel/CMakeFiles/fgpanel.dir/panel_io.cxx.o
[ 21%] Building CXX object src/FDM/YASim/CMakeFiles/yasim-proptest.dir/Hitch.cpp.o
In file included from /home/chris/fg2019_2/flightgear/src/FDM/YASim/Surface.cpp:2:0:
/home/chris/fg2019_2/flightgear/src/FDM/YASim/yasim-common.hpp:41:24: warning: ‘yasim::DEF_PROP_ELEVATOR_TRIM’ defined but not used [-Wunused-variable]
     static const char* DEF_PROP_ELEVATOR_TRIM = "/controls/flight/elevator-trim";
                        ^
[ 21%] Building CXX object src/FDM/YASim/CMakeFiles/yasim-proptest.dir/Hook.cpp.o
[ 21%] Building CXX object src/GUI/CMakeFiles/fgqmlui.dir/QQuickDrawable.cxx.o
In file included from /home/chris/fg2019_2/flightgear/src/FDM/YASim/Version.hpp:4:0,
                 from /home/chris/fg2019_2/flightgear/src/FDM/YASim/Version.cpp:5:
/home/chris/fg2019_2/flightgear/src/FDM/YASim/yasim-common.hpp:41:24: warning: ‘yasim::DEF_PROP_ELEVATOR_TRIM’ defined but not used [-Wunused-variable]
     static const char* DEF_PROP_ELEVATOR_TRIM = "/controls/flight/elevator-trim";
                        ^
[ 21%] Building CXX object src/GUI/CMakeFiles/fgqmlui.dir/QtQuickFGCanvasItem.cxx.o
In file included from /home/chris/fg2019_2/flightgear/src/FDM/YASim/yasim-common.cpp:1:0:
/home/chris/fg2019_2/flightgear/src/FDM/YASim/yasim-common.hpp:41:24: warning: ‘yasim::DEF_PROP_ELEVATOR_TRIM’ defined but not used [-Wunused-variable]
     static const char* DEF_PROP_ELEVATOR_TRIM = "/controls/flight/elevator-trim";
                        ^
In file included from /home/chris/fg2019_2/flightgear/src/FDM/YASim/Wing.cpp:1:0:
/home/chris/fg2019_2/flightgear/src/FDM/YASim/yasim-common.hpp:41:24: warning: ‘yasim::DEF_PROP_ELEVATOR_TRIM’ defined but not used [-Wunused-variable]
     static const char* DEF_PROP_ELEVATOR_TRIM = "/controls/flight/elevator-trim";
                        ^
[ 23%] Building CXX object src/GUI/CMakeFiles/fgqmlui.dir/PropertyItemModel.cxx.o
[ 23%] Building CXX object src/GUI/CMakeFiles/fgqmlui.dir/FGQmlInstance.cxx.o
[ 23%] Building CXX object src/FDM/YASim/CMakeFiles/yasim-proptest.dir/Integrator.cpp.o
[ 23%] Linking CXX executable yasim
[ 23%] Built target yasim
[ 23%] Building CXX object src/FDM/YASim/CMakeFiles/yasim-proptest.dir/Jet.cpp.o
[ 23%] Building CXX object src/FDM/YASim/CMakeFiles/yasim-proptest.dir/Launchbar.cpp.o
[ 25%] Building CXX object src/FDM/YASim/CMakeFiles/yasim-proptest.dir/Model.cpp.o
/home/chris/fg2019_2/flightgear/src/GUI/PropertyItemModel.cxx: In member function ‘virtual QVariant PropertyItemModel::data(const QModelIndex&, int) const’:
/home/chris/fg2019_2/flightgear/src/GUI/PropertyItemModel.cxx:70:21: warning: comparison between signed and unsigned integer expressions [-Wsign-compare]
     if (index.row() >= _nodes.size())
                     ^
[ 25%] Building CXX object utils/fgpanel/CMakeFiles/fgpanel.dir/GL_utils.cxx.o
[ 25%] Building CXX object src/FDM/YASim/CMakeFiles/yasim-proptest.dir/PistonEngine.cpp.o
[ 25%] Building CXX object src/FDM/YASim/CMakeFiles/yasim-proptest.dir/PropEngine.cpp.o
[ 25%] Building CXX object src/FDM/YASim/CMakeFiles/yasim-proptest.dir/Propeller.cpp.o
[ 25%] Building CXX object src/FDM/YASim/CMakeFiles/yasim-proptest.dir/Rotor.cpp.o
[ 25%] Building CXX object src/FDM/YASim/CMakeFiles/yasim-proptest.dir/RigidBody.cpp.o
[ 25%] Building CXX object src/GUI/CMakeFiles/fgqmlui.dir/FGQmlPropertyNode.cxx.o
[ 25%] Building CXX object src/GUI/CMakeFiles/fgqmlui.dir/QmlAircraftInfo.cxx.o
In file included from /home/chris/fg2019_2/flightgear/src/FDM/YASim/Version.hpp:4:0,
                 from /home/chris/fg2019_2/flightgear/src/FDM/YASim/Surface.hpp:5,
                 from /home/chris/fg2019_2/flightgear/src/FDM/YASim/Model.cpp:16:
/home/chris/fg2019_2/flightgear/src/FDM/YASim/yasim-common.hpp:41:24: warning: ‘yasim::DEF_PROP_ELEVATOR_TRIM’ defined but not used [-Wunused-variable]
     static const char* DEF_PROP_ELEVATOR_TRIM = "/controls/flight/elevator-trim";
                        ^
[ 25%] Linking CXX executable fgpanel
[ 25%] Building CXX object src/FDM/JSBSim/CMakeFiles/JSBSim.dir/initialization/FGInitialCondition.cpp.o
[ 25%] Building CXX object src/FDM/YASim/CMakeFiles/yasim-proptest.dir/Rotorpart.cpp.o
/usr/bin/ld: /usr/lib/gcc/x86_64-linux-gnu/5/../../../x86_64-linux-gnu/libGL.so: référence au symbole non défini « XextAddDisplay »
//usr/lib/x86_64-linux-gnu/libXext.so.6: error adding symbols: DSO manquant dans la ligne de commande
collect2: error: ld returned 1 exit status
utils/fgpanel/CMakeFiles/fgpanel.dir/build.make:394 : la recette pour la cible « utils/fgpanel/fgpanel » a échouée
make[2]: *** [utils/fgpanel/fgpanel] Erreur 1
CMakeFiles/Makefile2:688 : la recette pour la cible « utils/fgpanel/CMakeFiles/fgpanel.dir/all » a échouée
make[1]: *** [utils/fgpanel/CMakeFiles/fgpanel.dir/all] Erreur 2
make[1]: *** Attente des tâches non terminées....
[ 25%] Building CXX object src/FDM/YASim/CMakeFiles/yasim-proptest.dir/SimpleJet.cpp.o
[ 25%] Building CXX object src/FDM/YASim/CMakeFiles/yasim-proptest.dir/Surface.cpp.o
[ 25%] Building CXX object src/FDM/YASim/CMakeFiles/yasim-proptest.dir/TurbineEngine.cpp.o
[ 26%] Linking CXX executable fgviewer
[ 26%] Building CXX object src/FDM/YASim/CMakeFiles/yasim-proptest.dir/Turbulence.cpp.o
[ 26%] Building CXX object src/FDM/YASim/CMakeFiles/yasim-proptest.dir/Wing.cpp.o
[ 26%] Building CXX object src/GUI/CMakeFiles/fglauncher.dir/LauncherMainWindow.cxx.o
[ 26%] Building CXX object src/FDM/YASim/CMakeFiles/yasim-proptest.dir/Version.cpp.o
In file included from /home/chris/fg2019_2/flightgear/src/FDM/YASim/Surface.cpp:2:0:
/home/chris/fg2019_2/flightgear/src/FDM/YASim/yasim-common.hpp:41:24: warning: ‘yasim::DEF_PROP_ELEVATOR_TRIM’ defined but not used [-Wunused-variable]
     static const char* DEF_PROP_ELEVATOR_TRIM = "/controls/flight/elevator-trim";
                        ^
[ 26%] Building CXX object src/FDM/YASim/CMakeFiles/yasim-proptest.dir/yasim-common.cpp.o
[ 26%] Building CXX object src/GUI/CMakeFiles/fgqmlui.dir/LocalAircraftCache.cxx.o
In file included from /home/chris/fg2019_2/flightgear/src/FDM/YASim/Wing.cpp:1:0:
/home/chris/fg2019_2/flightgear/src/FDM/YASim/yasim-common.hpp:41:24: warning: ‘yasim::DEF_PROP_ELEVATOR_TRIM’ defined but not used [-Wunused-variable]
     static const char* DEF_PROP_ELEVATOR_TRIM = "/controls/flight/elevator-trim";
                        ^
[ 26%] Building CXX object src/GUI/CMakeFiles/fgqmlui.dir/PreviewImageItem.cxx.o
[ 26%] Building CXX object src/GUI/CMakeFiles/fgqmlui.dir/ThumbnailImageItem.cxx.o
[ 26%] Built target fgviewer
[ 26%] Building CXX object src/GUI/CMakeFiles/fgqmlui.dir/PopupWindowTracker.cxx.o
[ 26%] Building CXX object src/GUI/CMakeFiles/fgqmlui.dir/QmlPositioned.cxx.o
In file included from /home/chris/fg2019_2/flightgear/src/FDM/YASim/yasim-common.cpp:1:0:
/home/chris/fg2019_2/flightgear/src/FDM/YASim/yasim-common.hpp:41:24: warning: ‘yasim::DEF_PROP_ELEVATOR_TRIM’ defined but not used [-Wunused-variable]
     static const char* DEF_PROP_ELEVATOR_TRIM = "/controls/flight/elevator-trim";
                        ^
[ 26%] Building CXX object src/GUI/CMakeFiles/fgqmlui.dir/QmlNavCacheWrapper.cxx.o
In file included from /home/chris/fg2019_2/flightgear/src/FDM/YASim/Version.hpp:4:0,
                 from /home/chris/fg2019_2/flightgear/src/FDM/YASim/Version.cpp:5:
/home/chris/fg2019_2/flightgear/src/FDM/YASim/yasim-common.hpp:41:24: warning: ‘yasim::DEF_PROP_ELEVATOR_TRIM’ defined but not used [-Wunused-variable]
     static const char* DEF_PROP_ELEVATOR_TRIM = "/controls/flight/elevator-trim";
                        ^
[ 28%] Linking CXX executable yasim-proptest
[ 28%] Built target yasim-proptest
[ 28%] Building CXX object src/GUI/CMakeFiles/fgqmlui.dir/QmlRadioButtonHelper.cxx.o
/home/chris/fg2019_2/flightgear/src/GUI/LauncherMainWindow.cxx: In constructor ‘LauncherMainWindow::LauncherMainWindow()’:
/home/chris/fg2019_2/flightgear/src/GUI/LauncherMainWindow.cxx:89:10: warning: unused variable ‘selector’ [-Wunused-variable]
     auto selector = new QQmlFileSelector(engine(), this);
          ^
[ 28%] Building CXX object src/GUI/CMakeFiles/fgqmlui.dir/UnitsModel.cxx.o
[ 28%] Building CXX object src/GUI/CMakeFiles/fgqmlui.dir/NavaidSearchModel.cxx.o
[ 28%] Building CXX object src/GUI/CMakeFiles/fgqmlui.dir/FlightPlanController.cxx.o
[ 28%] Building CXX object src/GUI/CMakeFiles/fglauncher.dir/BaseDiagram.cxx.o
[ 30%] Building CXX object src/GUI/CMakeFiles/fgqmlui.dir/RouteDiagram.cxx.o
[ 30%] Building CXX object src/FDM/JSBSim/CMakeFiles/JSBSim.dir/initialization/FGTrim.cpp.o
[ 30%] Building CXX object src/GUI/CMakeFiles/fgqmlui.dir/ModelDataExtractor.cxx.o
/home/chris/fg2019_2/flightgear/src/GUI/UnitsModel.cxx: In member function ‘virtual QVariant UnitsModel::data(const QModelIndex&, int) const’:
/home/chris/fg2019_2/flightgear/src/GUI/UnitsModel.cxx:129:27: warning: comparison between signed and unsigned integer expressions [-Wsign-compare]
     if ((row < 0) || (row >= m_enabledUnits.size()))
                           ^
/home/chris/fg2019_2/flightgear/src/GUI/UnitsModel.cxx: In member function ‘void UnitsModel::setSelectedIndex(int)’:
/home/chris/fg2019_2/flightgear/src/GUI/UnitsModel.cxx:270:23: warning: comparison between signed and unsigned integer expressions [-Wsign-compare]
     if (m_activeIndex == selectedIndex)
                       ^
/home/chris/fg2019_2/flightgear/src/GUI/UnitsModel.cxx:273:47: warning: comparison between signed and unsigned integer expressions [-Wsign-compare]
     if ((selectedIndex < 0) || (selectedIndex >= m_enabledUnits.size()))
                                               ^
[ 30%] Building CXX object src/GUI/CMakeFiles/fglauncher.dir/AirportDiagram.cxx.o
[ 30%] Building CXX object src/GUI/CMakeFiles/fglauncher.dir/NavaidDiagram.cxx.o
[ 30%] Building CXX object src/GUI/CMakeFiles/fglauncher.dir/SetupRootDialog.cxx.o
[ 30%] Building CXX object src/GUI/CMakeFiles/fglauncher.dir/AircraftModel.cxx.o
[ 30%] Building CXX object src/GUI/CMakeFiles/fglauncher.dir/CatalogListModel.cxx.o
/home/chris/fg2019_2/flightgear/src/GUI/NavaidSearchModel.cxx: In member function ‘qlonglong NavaidSearchModel::guidAtIndex(int) const’:
/home/chris/fg2019_2/flightgear/src/GUI/NavaidSearchModel.cxx:153:31: warning: comparison between signed and unsigned integer expressions [-Wsign-compare]
     if ((index < 0) || (index >= m_ids.size()))
                               ^
[ 30%] Building CXX object src/GUI/CMakeFiles/fglauncher.dir/QtMessageBox.cxx.o
[ 30%] Building CXX object src/FDM/JSBSim/CMakeFiles/JSBSim.dir/initialization/FGTrimAxis.cpp.o
[ 31%] Building CXX object src/FDM/JSBSim/CMakeFiles/JSBSim.dir/input_output/FGGroundCallback.cpp.o
[ 31%] Building CXX object src/FDM/JSBSim/CMakeFiles/JSBSim.dir/input_output/FGPropertyReader.cpp.o
[ 31%] Building CXX object src/GUI/CMakeFiles/fglauncher.dir/QtFileDialog.cxx.o
[ 31%] Linking C static library libfgsqlite3.a
[ 31%] Built target fgsqlite3
[ 31%] Building CXX object src/GUI/CMakeFiles/fglauncher.dir/InstallSceneryDialog.cxx.o
[ 31%] Building CXX object src/FDM/JSBSim/CMakeFiles/JSBSim.dir/input_output/FGPropertyManager.cpp.o
[ 31%] Linking CXX static library libfgqmlui.a
/home/chris/fg2019_2/flightgear/src/GUI/CatalogListModel.cxx: In member function ‘void CatalogListModel::removeCatalog(int)’:
/home/chris/fg2019_2/flightgear/src/GUI/CatalogListModel.cxx:177:31: warning: comparison between signed and unsigned integer expressions [-Wsign-compare]
     if ((index < 0) || (index >= m_catalogs.size())) {
                               ^
/home/chris/fg2019_2/flightgear/src/GUI/CatalogListModel.cxx: In member function ‘void CatalogListModel::refreshCatalog(int)’:
/home/chris/fg2019_2/flightgear/src/GUI/CatalogListModel.cxx:188:31: warning: comparison between signed and unsigned integer expressions [-Wsign-compare]
     if ((index < 0) || (index >= m_catalogs.size())) {
                               ^
[ 31%] Built target fgqmlui
[ 31%] Building CXX object src/FDM/JSBSim/CMakeFiles/JSBSim.dir/input_output/FGScript.cpp.o
[ 33%] Building CXX object src/GUI/CMakeFiles/fglauncher.dir/LocationController.cxx.o
[ 33%] Building CXX object src/FDM/JSBSim/CMakeFiles/JSBSim.dir/input_output/FGXMLElement.cpp.o
[ 33%] Building CXX object src/GUI/CMakeFiles/fglauncher.dir/LauncherArgumentTokenizer.cxx.o
[ 33%] Building CXX object src/FDM/JSBSim/CMakeFiles/JSBSim.dir/input_output/FGXMLParse.cpp.o
[ 33%] Building CXX object src/FDM/JSBSim/CMakeFiles/JSBSim.dir/input_output/FGfdmSocket.cpp.o
[ 33%] Building CXX object src/GUI/CMakeFiles/fglauncher.dir/AircraftSearchFilterModel.cxx.o
[ 33%] Building CXX object src/FDM/JSBSim/CMakeFiles/JSBSim.dir/input_output/FGInputType.cpp.o
[ 33%] Building CXX object src/GUI/CMakeFiles/fglauncher.dir/DefaultAircraftLocator.cxx.o
[ 33%] Building CXX object src/GUI/CMakeFiles/fglauncher.dir/LaunchConfig.cxx.o
[ 33%] Building CXX object src/GUI/CMakeFiles/fglauncher.dir/MPServersModel.cpp.o
[ 33%] Building CXX object src/FDM/JSBSim/CMakeFiles/JSBSim.dir/input_output/FGInputSocket.cpp.o
[ 33%] Building CXX object src/GUI/CMakeFiles/fglauncher.dir/PathUrlHelper.cxx.o
[ 33%] Building CXX object src/FDM/JSBSim/CMakeFiles/JSBSim.dir/input_output/FGUDPInputSocket.cpp.o
[ 33%] Building CXX object src/GUI/CMakeFiles/fglauncher.dir/RecentAircraftModel.cxx.o
[ 33%] Building CXX object src/GUI/CMakeFiles/fglauncher.dir/RecentLocationsModel.cxx.o
/home/chris/fg2019_2/flightgear/src/GUI/DefaultAircraftLocator.cxx: In member function ‘virtual QVariant flightgear::WeatherScenariosModel::data(const QModelIndex&, int) const’:
/home/chris/fg2019_2/flightgear/src/GUI/DefaultAircraftLocator.cxx:123:27: warning: comparison between signed and unsigned integer expressions [-Wsign-compare]
     if ((row < 0) || (row >= m_scenarios.size())) {
                           ^
/home/chris/fg2019_2/flightgear/src/GUI/MPServersModel.cpp: In member function ‘QString MPServersModel::currentServer() const’:
/home/chris/fg2019_2/flightgear/src/GUI/MPServersModel.cpp:184:24: warning: comparison between signed and unsigned integer expressions [-Wsign-compare]
     if (m_currentIndex == m_servers.size()) {
                        ^
[ 33%] Building CXX object src/FDM/JSBSim/CMakeFiles/JSBSim.dir/input_output/FGOutputFG.cpp.o
[ 33%] Building CXX object src/GUI/CMakeFiles/fglauncher.dir/LauncherController.cxx.o
[ 33%] Building CXX object src/GUI/CMakeFiles/fglauncher.dir/AddOnsController.cxx.o
[ 33%] Building CXX object src/FDM/JSBSim/CMakeFiles/JSBSim.dir/input_output/FGOutputFile.cpp.o
[ 33%] Building CXX object src/GUI/CMakeFiles/fglauncher.dir/AddonsModel.cxx.o
[ 33%] Building CXX object src/GUI/CMakeFiles/fglauncher.dir/PixmapImageItem.cxx.o
[ 33%] Building CXX object src/GUI/CMakeFiles/fglauncher.dir/qrc_resources.cpp.o
[ 33%] Building CXX object src/FDM/JSBSim/CMakeFiles/JSBSim.dir/input_output/FGOutputSocket.cpp.o
[ 33%] Building CXX object src/FDM/JSBSim/CMakeFiles/JSBSim.dir/input_output/FGOutputTextFile.cpp.o
[ 35%] Building CXX object src/FDM/JSBSim/CMakeFiles/JSBSim.dir/input_output/FGOutputType.cpp.o
[ 35%] Building CXX object src/FDM/JSBSim/CMakeFiles/JSBSim.dir/input_output/FGModelLoader.cpp.o
[ 35%] Building CXX object src/FDM/JSBSim/CMakeFiles/JSBSim.dir/math/FGColumnVector3.cpp.o
[ 35%] Building CXX object src/FDM/JSBSim/CMakeFiles/JSBSim.dir/math/FGCondition.cpp.o
[ 35%] Building CXX object src/FDM/JSBSim/CMakeFiles/JSBSim.dir/math/FGFunction.cpp.o
[ 35%] Building CXX object src/FDM/JSBSim/CMakeFiles/JSBSim.dir/math/FGLocation.cpp.o
[ 35%] Building CXX object src/FDM/JSBSim/CMakeFiles/JSBSim.dir/math/FGMatrix33.cpp.o
[ 35%] Building CXX object src/FDM/JSBSim/CMakeFiles/JSBSim.dir/math/FGModelFunctions.cpp.o
[ 35%] Building CXX object src/FDM/JSBSim/CMakeFiles/JSBSim.dir/math/FGPropertyValue.cpp.o
[ 35%] Building CXX object src/FDM/JSBSim/CMakeFiles/JSBSim.dir/math/FGQuaternion.cpp.o
[ 35%] Building CXX object src/FDM/JSBSim/CMakeFiles/JSBSim.dir/math/FGRealValue.cpp.o
[ 35%] Building CXX object src/FDM/JSBSim/CMakeFiles/JSBSim.dir/math/FGRungeKutta.cpp.o
[ 35%] Building CXX object src/FDM/JSBSim/CMakeFiles/JSBSim.dir/math/FGTable.cpp.o
[ 35%] Building CXX object src/FDM/JSBSim/CMakeFiles/JSBSim.dir/math/FGTemplateFunc.cpp.o
[ 35%] Building CXX object src/FDM/JSBSim/CMakeFiles/JSBSim.dir/models/FGAccelerations.cpp.o
[ 36%] Building CXX object src/FDM/JSBSim/CMakeFiles/JSBSim.dir/models/FGAerodynamics.cpp.o
[ 36%] Building CXX object src/FDM/JSBSim/CMakeFiles/JSBSim.dir/models/FGAircraft.cpp.o
[ 36%] Building CXX object src/FDM/JSBSim/CMakeFiles/JSBSim.dir/models/FGAtmosphere.cpp.o
[ 36%] Building CXX object src/FDM/JSBSim/CMakeFiles/JSBSim.dir/models/FGAuxiliary.cpp.o
[ 36%] Building CXX object src/FDM/JSBSim/CMakeFiles/JSBSim.dir/models/FGBuoyantForces.cpp.o
[ 36%] Building CXX object src/FDM/JSBSim/CMakeFiles/JSBSim.dir/models/FGExternalForce.cpp.o
[ 36%] Building CXX object src/FDM/JSBSim/CMakeFiles/JSBSim.dir/models/FGExternalReactions.cpp.o
[ 36%] Building CXX object src/FDM/JSBSim/CMakeFiles/JSBSim.dir/models/FGFCS.cpp.o
[ 36%] Building CXX object src/FDM/JSBSim/CMakeFiles/JSBSim.dir/models/FGGasCell.cpp.o
[ 36%] Building CXX object src/FDM/JSBSim/CMakeFiles/JSBSim.dir/models/FGSurface.cpp.o
[ 36%] Building CXX object src/FDM/JSBSim/CMakeFiles/JSBSim.dir/models/FGGroundReactions.cpp.o
[ 36%] Building CXX object src/FDM/JSBSim/CMakeFiles/JSBSim.dir/models/FGInertial.cpp.o
[ 36%] Building CXX object src/FDM/JSBSim/CMakeFiles/JSBSim.dir/models/FGInput.cpp.o
[ 36%] Building CXX object src/FDM/JSBSim/CMakeFiles/JSBSim.dir/models/FGLGear.cpp.o
[ 36%] Building CXX object src/FDM/JSBSim/CMakeFiles/JSBSim.dir/models/FGMassBalance.cpp.o
[ 38%] Building CXX object src/FDM/JSBSim/CMakeFiles/JSBSim.dir/models/FGModel.cpp.o
[ 38%] Building CXX object src/FDM/JSBSim/CMakeFiles/JSBSim.dir/models/FGOutput.cpp.o
[ 38%] Building CXX object src/FDM/JSBSim/CMakeFiles/JSBSim.dir/models/FGPropagate.cpp.o
[ 38%] Building CXX object src/FDM/JSBSim/CMakeFiles/JSBSim.dir/models/FGPropulsion.cpp.o
[ 38%] Building CXX object src/FDM/JSBSim/CMakeFiles/JSBSim.dir/models/atmosphere/FGMSIS.cpp.o
[ 38%] Linking CXX static library libfglauncher.a
[ 38%] Building CXX object src/FDM/JSBSim/CMakeFiles/JSBSim.dir/models/atmosphere/FGMSISData.cpp.o
[ 38%] Building CXX object src/FDM/JSBSim/CMakeFiles/JSBSim.dir/models/atmosphere/FGStandardAtmosphere.cpp.o
[ 38%] Building CXX object src/FDM/JSBSim/CMakeFiles/JSBSim.dir/models/atmosphere/FGMars.cpp.o
[ 40%] Built target fglauncher
[ 40%] Building CXX object src/FDM/JSBSim/CMakeFiles/JSBSim.dir/models/atmosphere/FGWinds.cpp.o
[ 40%] Building CXX object src/FDM/JSBSim/CMakeFiles/JSBSim.dir/models/flight_control/FGAccelerometer.cpp.o
[ 40%] Building CXX object src/FDM/JSBSim/CMakeFiles/JSBSim.dir/models/flight_control/FGActuator.cpp.o
[ 40%] Building CXX object src/FDM/JSBSim/CMakeFiles/JSBSim.dir/models/flight_control/FGAngles.cpp.o
[ 40%] Building CXX object src/FDM/JSBSim/CMakeFiles/JSBSim.dir/models/flight_control/FGDeadBand.cpp.o
[ 40%] Building CXX object src/FDM/JSBSim/CMakeFiles/JSBSim.dir/models/flight_control/FGFCSComponent.cpp.o
[ 41%] Building CXX object src/FDM/JSBSim/CMakeFiles/JSBSim.dir/models/flight_control/FGFCSFunction.cpp.o
[ 41%] Building CXX object src/FDM/JSBSim/CMakeFiles/JSBSim.dir/models/flight_control/FGFilter.cpp.o
[ 41%] Building CXX object src/FDM/JSBSim/CMakeFiles/JSBSim.dir/models/flight_control/FGGain.cpp.o
[ 41%] Building CXX object src/FDM/JSBSim/CMakeFiles/JSBSim.dir/models/flight_control/FGGyro.cpp.o
[ 41%] Building CXX object src/FDM/JSBSim/CMakeFiles/JSBSim.dir/models/flight_control/FGKinemat.cpp.o
[ 41%] Building CXX object src/FDM/JSBSim/CMakeFiles/JSBSim.dir/models/flight_control/FGMagnetometer.cpp.o
[ 41%] Building CXX object src/FDM/JSBSim/CMakeFiles/JSBSim.dir/models/flight_control/FGPID.cpp.o
[ 41%] Building CXX object src/FDM/JSBSim/CMakeFiles/JSBSim.dir/models/flight_control/FGSensor.cpp.o
[ 41%] Building CXX object src/FDM/JSBSim/CMakeFiles/JSBSim.dir/models/flight_control/FGSummer.cpp.o
[ 41%] Building CXX object src/FDM/JSBSim/CMakeFiles/JSBSim.dir/models/flight_control/FGSwitch.cpp.o
[ 41%] Building CXX object src/FDM/JSBSim/CMakeFiles/JSBSim.dir/models/flight_control/FGWaypoint.cpp.o
[ 41%] Building CXX object src/FDM/JSBSim/CMakeFiles/JSBSim.dir/models/flight_control/FGDistributor.cpp.o
[ 41%] Building CXX object src/FDM/JSBSim/CMakeFiles/JSBSim.dir/models/flight_control/FGLinearActuator.cpp.o
[ 41%] Building CXX object src/FDM/JSBSim/CMakeFiles/JSBSim.dir/models/propulsion/FGElectric.cpp.o
[ 41%] Building CXX object src/FDM/JSBSim/CMakeFiles/JSBSim.dir/models/propulsion/FGEngine.cpp.o
[ 43%] Building CXX object src/FDM/JSBSim/CMakeFiles/JSBSim.dir/models/propulsion/FGForce.cpp.o
[ 43%] Building CXX object src/FDM/JSBSim/CMakeFiles/JSBSim.dir/models/propulsion/FGNozzle.cpp.o
[ 43%] Building CXX object src/FDM/JSBSim/CMakeFiles/JSBSim.dir/models/propulsion/FGPiston.cpp.o
[ 43%] Building CXX object src/FDM/JSBSim/CMakeFiles/JSBSim.dir/models/propulsion/FGPropeller.cpp.o
[ 43%] Building CXX object src/FDM/JSBSim/CMakeFiles/JSBSim.dir/models/propulsion/FGRocket.cpp.o
[ 43%] Building CXX object src/FDM/JSBSim/CMakeFiles/JSBSim.dir/models/propulsion/FGRotor.cpp.o
[ 43%] Building CXX object src/FDM/JSBSim/CMakeFiles/JSBSim.dir/models/propulsion/FGTank.cpp.o
[ 43%] Building CXX object src/FDM/JSBSim/CMakeFiles/JSBSim.dir/models/propulsion/FGThruster.cpp.o
[ 43%] Building CXX object src/FDM/JSBSim/CMakeFiles/JSBSim.dir/models/propulsion/FGTransmission.cpp.o
[ 43%] Building CXX object src/FDM/JSBSim/CMakeFiles/JSBSim.dir/models/propulsion/FGTurbine.cpp.o
[ 43%] Building CXX object src/FDM/JSBSim/CMakeFiles/JSBSim.dir/models/propulsion/FGTurboProp.cpp.o
[ 43%] Linking CXX static library libJSBSim.a
[ 43%] Built target JSBSim
Makefile:162 : la recette pour la cible « all » a échouée
make: *** [all] Erreur 2
INSTALL flightgear
[  0%] Built target fgsqlite3
[  8%] Built target iaxclient_lib
[ 13%] Built target flite_hts
[ 13%] Built target hts_engine
[ 13%] Built target PLIBJoystick
[ 13%] Built target fgelev
[ 13%] Linking CXX executable fgpanel
/usr/bin/ld: /usr/lib/gcc/x86_64-linux-gnu/5/../../../x86_64-linux-gnu/libGL.so: référence au symbole non défini « XextAddDisplay »
//usr/lib/x86_64-linux-gnu/libXext.so.6: error adding symbols: DSO manquant dans la ligne de commande
collect2: error: ld returned 1 exit status
utils/fgpanel/CMakeFiles/fgpanel.dir/build.make:394 : la recette pour la cible « utils/fgpanel/fgpanel » a échouée
make[2]: *** [utils/fgpanel/fgpanel] Erreur 1
CMakeFiles/Makefile2:688 : la recette pour la cible « utils/fgpanel/CMakeFiles/fgpanel.dir/all » a échouée
make[1]: *** [utils/fgpanel/CMakeFiles/fgpanel.dir/all] Erreur 2
Makefile:162 : la recette pour la cible « all » a échouée
make: *** [all] Erreur 2
***********************************
All optional package alternatives have found a matching package.

Fg 2019.2.0 - LinuxMint 19.1 Tessa - CM Asus P8H67 MLE - CPU i3 2100T - 12 Go Ram - Nvidia Geforce GTX 770 - Driver Nvidia 384.130
+ Hp notebook-15-da0118nf -  CPU i3-7020u - Ram 4Go - Intel Graphics 620.

Hors ligne

#27 20/03/2019 20:04:24

f-toro
Administrateur
Lieu : LFLA
Inscription : 16/12/2007
Messages : 2 511

Re : Erreur compilation FGFS

Clm76 a écrit :

Hum !... Je ne suis pas du tout sûr que ce soit un problème de version de LM

Ben moi je le suis.


André. anciennement taureau89_9
Debian Testing Amd64. CM Sabertooth 990FX, FX8350, 32 Go Ram DDR3 1866 Mhz, GTX 750ti 2Go, DD 2To Sata 3, THRUSTMASTER T.Flight StickX, FG 2019.2.0 Git.

Hors ligne

#28 20/03/2019 20:45:06

Clm76
Membre
Lieu : LFOH
Inscription : 22/10/2012
Messages : 1 043

Re : Erreur compilation FGFS

f-toro a écrit :

Ben moi je le suis.

Alors pourquoi ai-je pu upgrader fg2018.4 en fg2019.2 ? hmm


Fg 2019.2.0 - LinuxMint 19.1 Tessa - CM Asus P8H67 MLE - CPU i3 2100T - 12 Go Ram - Nvidia Geforce GTX 770 - Driver Nvidia 384.130
+ Hp notebook-15-da0118nf -  CPU i3-7020u - Ram 4Go - Intel Graphics 620.

Hors ligne

#29 20/03/2019 21:18:42

ctesc356
Membre
Inscription : 18/05/2010
Messages : 2 715

Re : Erreur compilation FGFS

Clm76 a écrit :

Alors pourquoi ai-je pu upgrader fg2018.4 en fg2019.2 ? hmm

Grand mystère...quoi-que...
Je viens de compiler osg, sg, fgfs sur un pc en mint 18.3. C'est passé sans souci.

Seule différence que je vois, tu n'utilises pas la dernière version de d&c : https://sourceforge.net/p/flightgear/fg … compile.sh

commit caad4... du 2019-02-11 22:39:29
Essaie avec cette version en laissant faire le apt update/install (pas de -pn)


Intel i5 3570 3.4Mhz, Nvidia GTX 660, 8Go Ram, Linux Mint

Hors ligne

#30 20/03/2019 21:37:01

f-toro
Administrateur
Lieu : LFLA
Inscription : 16/12/2007
Messages : 2 511

Re : Erreur compilation FGFS

Clm76 a écrit :

Alors pourquoi ai-je pu upgrader fg2018.4 en fg2019.2 ? hmm

Ça impossible de te le dire puisque tu ne nous as pas fourni le log complet de cette compilation.

Mais ce qui est sûr :
- c'est que chaque fois qu'on a un OS avec des paquets anciens il y a des erreurs de compilation.
C'est la raison pour laquelle je suis en testing (système mis à jour tous les jours, pas de version figée).
Après avoir connu des difficultés de compilation dues à des paquets obsolètes.
Et ce depuis plus de dix ans !
-c'est qu'il n'y a pas forcément besoin d'être en testing pour que la compilation passe sans souci.
Avec LM ça marche très bien aussi.
Mais à condition de passer de suite à la dernière version de LM dès qu'elle fait son apparition.
Pour avoir des paquets récents.
Sinon difficultés assurées, et de plus en plus fréquentes au fur et à mesure qua FG évolue.
Cela fait partie de ce qui a déjà été constaté sur le forum par le passé.

Alors pourquoi ne pas écouter les conseils, et s'obstiner à rester sur une version dépassée ?
(voir aussi l'expérience de Patten qui lui aussi a beaucoup "grenouillé", mais à qui je fais confiance pour ne pas s'obstiner indéfiniment sur une 18.3)
Mais bon, si tu veux continuer à t'embêter...


André. anciennement taureau89_9
Debian Testing Amd64. CM Sabertooth 990FX, FX8350, 32 Go Ram DDR3 1866 Mhz, GTX 750ti 2Go, DD 2To Sata 3, THRUSTMASTER T.Flight StickX, FG 2019.2.0 Git.

Hors ligne

#31 21/03/2019 11:35:34

Clm76
Membre
Lieu : LFOH
Inscription : 22/10/2012
Messages : 1 043

Re : Erreur compilation FGFS

ctesc356 a écrit :

Seule différence que je vois, tu n'utilises pas la dernière version de d&c

Effectivement, je n'avais pas la dernière version de d&c qui m'a installé de nouvelles librairies :
  libqt5designercomponents5
  libqt5websockets5
  libqt5websockets5-dev
  qttools5-dev-tools
Dommage que le n° de version de d&c ne s'affiche plus ! sad

Recompilation : tout passe correctement sauf FGFS qui a toujours les mêmes erreurs de link.

Nouvel essai en copiant mon ancien répertoire fg2018_4 et en le renommant fg2019_2 puis en compilant "par dessus" SIMGEAR FGFS DATA.
Tout est ok, plus d'erreurs et je suis bien en version 2019.2 avec OSG3.4

f-toro a écrit :

Alors pourquoi ne pas écouter les conseils, et s'obstiner à rester sur une version dépassée ?

Mais j'écoute les conseils smile ... mais je suis toujours assez frileux pour changer de version sur mon ordi principal qui est en dual boot avec W après avoir connu, une fois, un blocage complet du boot et  des heures de galère à la clé. mad
Je vais y passer sur mon portable de test et voir si c'est bien la cause du problème de compilation.


Fg 2019.2.0 - LinuxMint 19.1 Tessa - CM Asus P8H67 MLE - CPU i3 2100T - 12 Go Ram - Nvidia Geforce GTX 770 - Driver Nvidia 384.130
+ Hp notebook-15-da0118nf -  CPU i3-7020u - Ram 4Go - Intel Graphics 620.

Hors ligne

#32 21/03/2019 12:16:11

f-toro
Administrateur
Lieu : LFLA
Inscription : 16/12/2007
Messages : 2 511

Re : Erreur compilation FGFS

Clm76 a écrit :

Mais j'écoute les conseils smile ... mais je suis toujours assez frileux pour changer de version sur mon ordi principal qui est en dual boot avec W après avoir connu, une fois, un blocage complet du boot et  des heures de galère à la clé.

Ça tu ne l'avais pas dit, et maintenant je comprends mieux.
D'autant mieux que j'ai eu aussi la même galère.
J'ai solutionné de façon radicale, et depuis des années.
Un poste dédié Debian testing et un poste dédié Windows.
J'ai toujours été convaincu que le dual boot Win/Gnu-Linux était un gros risque.
Mais il ne manque pas de membres sur le forum qui utilisent cette solution et ne s'en plaignent pas.
Moi j'ai définitivement décidé de ne plus prendre le risque.
Ça finit toujours un jour d'être embêtant de mêler les torchons et les serviettes...
Tout ceci n'empêche pas que tu ne pourras pas rester indéfiniment en 18.3 .


André. anciennement taureau89_9
Debian Testing Amd64. CM Sabertooth 990FX, FX8350, 32 Go Ram DDR3 1866 Mhz, GTX 750ti 2Go, DD 2To Sata 3, THRUSTMASTER T.Flight StickX, FG 2019.2.0 Git.

Hors ligne

#33 21/03/2019 12:56:15

Clm76
Membre
Lieu : LFOH
Inscription : 22/10/2012
Messages : 1 043

Re : Erreur compilation FGFS

f-toro a écrit :

J'ai solutionné de façon radicale, et depuis des années.
Un poste dédié Debian testing et un poste dédié Windows.

Tu as raison et c'est certainement ce que je ferai dans un avenir proche quand j'aurai trouvé un moyen de cloner mon disque dur W pour le mettre sur un portable dédié. Le logiciel que j'utilisais n'existe plus. sad

En attendant, l'upgrade de mon portable Mint est en cours...


Fg 2019.2.0 - LinuxMint 19.1 Tessa - CM Asus P8H67 MLE - CPU i3 2100T - 12 Go Ram - Nvidia Geforce GTX 770 - Driver Nvidia 384.130
+ Hp notebook-15-da0118nf -  CPU i3-7020u - Ram 4Go - Intel Graphics 620.

Hors ligne

#34 22/03/2019 22:26:38

f-toro
Administrateur
Lieu : LFLA
Inscription : 16/12/2007
Messages : 2 511

Re : Erreur compilation FGFS

Bonsoir les amis.
J'ai voulu en avoir le coeur net avec cette histoire de version de LM qui permet de compiler ou non.
Car j'ai aussi (hé oui, je suis équipé) un poste Linux Mint dont je ne me sers quasiement jamais.
Il était en LM18, mais pas en 18.3 Sylvia.

J'ai donc commencé par l'upgrader en 18.3 à l'aide de l'outil graphique présent dans le gestionnaire de mise à jour.
Puis j'ai lancé le script d&c, avec l'objectif de ne compiler que SIMGEAR, FGFS, et récupérer le DATA.
Je laisse le script utiliser les paquets système libplib et libopenscenegraph.
Je ne veux compiler ni l'un ni l'autre.
Ce sont des environnements très peu évolutifs, les paquets système sont à priori bien suffisants.
Résultat : la compilation de SIMGEAR échoue.
Voici le log :

download_and_compile.sh ALL
VERSION=$Id
APT_GET_UPDATE=y
DOWNLOAD_PACKAGES=y
COMPILE=y
RECONFIGURE=y
DOWNLOAD=y
JOPTION= -j6
OOPTION=
BUILD_TYPE=RelWithDebInfo
DIRECTORY=/home/elisa/fgfs
***********************************
Running 'sudo apt-get update'...
Considering a package alternative: libcurl4-openssl-dev libcurl4-gnutls-dev
Package alternative matched for libcurl4-openssl-dev
Considering a package alternative: libopenscenegraph-3.4-dev libopenscenegraph-dev libopenscenegraph-[0-9]+\.[0-9]+-dev
Package alternative matched for libopenscenegraph-dev
Considering a package alternative: libpng-dev libpng12-dev libpng16-dev
Package alternative matched for libpng12-dev
Considering an optional package alternative: qt5-default
Optional package alternative matched for qt5-default
Considering an optional package alternative: qtdeclarative5-dev
Optional package alternative matched for qtdeclarative5-dev
Considering an optional package alternative: qtbase5-dev-tools
Optional package alternative matched for qtbase5-dev-tools
Considering an optional package alternative: qttools5-dev-tools
Optional package alternative matched for qttools5-dev-tools
Considering an optional package alternative: qml-module-qtquick2
Optional package alternative matched for qml-module-qtquick2
Considering an optional package alternative: qml-module-qtquick-window2
Optional package alternative matched for qml-module-qtquick-window2
Considering an optional package alternative: qml-module-qtquick-dialogs
Optional package alternative matched for qml-module-qtquick-dialogs
Considering an optional package alternative: libqt5opengl5-dev
Optional package alternative matched for libqt5opengl5-dev
Considering an optional package alternative: libqt5svg5-dev
Optional package alternative matched for libqt5svg5-dev
Considering an optional package alternative: libqt5websockets5-dev
Optional package alternative matched for libqt5websockets5-dev
Considering an optional package alternative: qtbase5-private-dev
Optional package alternative matched for qtbase5-private-dev
Considering an optional package alternative: qtdeclarative5-private-dev
Optional package alternative matched for qtdeclarative5-private-dev
Running 'sudo apt-get install build-essential cmake git libcurl4-openssl-dev libarchive-dev libbz2-dev libexpat1-dev libjsoncpp-dev liblzma-dev libncurses5-dev procps zlib1g-dev libcgal-dev libgdal-dev libtiff5-dev libqt4-dev zlib1g-dev freeglut3-dev libglew-dev libboost-dev libopenscenegraph-dev libopenal-dev libudev-dev libdbus-1-dev libplib-dev libpng12-dev qt5-default qtdeclarative5-dev qtbase5-dev-tools qttools5-dev-tools qml-module-qtquick2 qml-module-qtquick-window2 qml-module-qtquick-dialogs libqt5opengl5-dev libqt5svg5-dev libqt5websockets5-dev qtbase5-private-dev qtdeclarative5-private-dev fluid libbz2-dev libfltk1.3-dev libxi-dev libxmu-dev libxinerama-dev libjpeg-dev libxft-dev python3-pyqt5 python3-pyqt5.qtmultimedia libqt5multimedia5-plugins python-tk'...

****************************************
**************** SIMGEAR ***************
****************************************
Fetching SIMGEAR with 'git clone https://git.code.sf.net/p/flightgear/simgear'
-- CMAKE Build type: RelWithDebInfo
-- The C compiler identification is GNU 5.4.0
-- The CXX compiler identification is GNU 5.4.0
-- Check for working C compiler: /usr/bin/cc
-- Check for working C compiler: /usr/bin/cc -- works
-- Detecting C compiler ABI info
-- Detecting C compiler ABI info - done
-- Detecting C compile features
-- Detecting C compile features - done
-- Check for working CXX compiler: /usr/bin/c++
-- Check for working CXX compiler: /usr/bin/c++ -- works
-- Detecting CXX compiler ABI info
-- Detecting CXX compiler ABI info - done
-- Detecting CXX compile features
-- Detecting CXX compile features - done
-- version is 2019 dot 2 dot 0
-- Library installation directory: lib
-- Looking for pthread.h
-- Looking for pthread.h - found
-- Looking for pthread_create
-- Looking for pthread_create - not found
-- Looking for pthread_create in pthreads
-- Looking for pthread_create in pthreads - not found
-- Looking for pthread_create in pthread
-- Looking for pthread_create in pthread - found
-- Found Threads: TRUE  
-- Boost version: 1.58.0
-- SimGear mode: NORMAL
-- Found OpenGL: /usr/lib/x86_64-linux-gnu/libGL.so  
-- Found OpenAL: /usr/lib/x86_64-linux-gnu/libopenal.so  
-- Sound support: OpenAL
-- Found osgText: /usr/lib/x86_64-linux-gnu/libosgText.so  
-- Found osgSim: /usr/lib/x86_64-linux-gnu/libosgSim.so  
-- Found osgDB: /usr/lib/x86_64-linux-gnu/libosgDB.so  
-- Found osgParticle: /usr/lib/x86_64-linux-gnu/libosgParticle.so  
-- Found osgGA: /usr/lib/x86_64-linux-gnu/libosgGA.so  
-- Found osgViewer: /usr/lib/x86_64-linux-gnu/libosgViewer.so  
-- Found osgUtil: /usr/lib/x86_64-linux-gnu/libosgUtil.so  
-- Found osg: /usr/lib/x86_64-linux-gnu/libosg.so  
-- Found OpenThreads: /usr/lib/x86_64-linux-gnu/libOpenThreads.so  
-- Found OpenSceneGraph: /usr/lib/x86_64-linux-gnu/libosgText.so;/usr/lib/x86_64-linux-gnu/libosgSim.so;/usr/lib/x86_64-linux-gnu/libosgDB.so;/usr/lib/x86_64-linux-gnu/libosgParticle.so;/usr/lib/x86_64-linux-gnu/libosgGA.so;/usr/lib/x86_64-linux-gnu/libosgViewer.so;/usr/lib/x86_64-linux-gnu/libosgUtil.so;/usr/lib/x86_64-linux-gnu/libosg.so;/usr/lib/x86_64-linux-gnu/libOpenThreads.so (found suitable version "3.2.1", minimum required is "3.2.0") 
-- Found ZLIB: /usr/lib/x86_64-linux-gnu/libz.so (found suitable version "1.2.8", minimum required is "1.2.4") 
-- Found CURL: /usr/lib/x86_64-linux-gnu/libcurl.so (found version "7.47.0") 
-- Using built-in expat code
-- Looking for inttypes.h
-- Looking for inttypes.h - found
-- Looking for sys/time.h
-- Looking for sys/time.h - found
-- Looking for unistd.h
-- Looking for unistd.h - found
-- Looking for windows.h
-- Looking for windows.h - not found
-- RTI: DISABLED
-- Looking for gettimeofday
-- Looking for gettimeofday - found
-- Looking for rint
-- Looking for rint - not found
-- Looking for mkdtemp
-- Looking for mkdtemp - found
-- Looking for bcopy
-- Looking for bcopy - found
-- Looking for mmap
-- Looking for mmap - found
-- Looking for timegm
-- Looking for timegm - found
-- Performing Test HAVE_CLOCK_GETTIME
-- Performing Test HAVE_CLOCK_GETTIME - Success
-- Looking for clock_gettime in rt
-- Looking for clock_gettime in rt - found
-- Performing Test HAVE_DLFCN_H
-- Performing Test HAVE_DLFCN_H - Success
-- Looking for dlerror in dl
-- Looking for dlerror in dl - found
-- Performing Test HAVE_STD_ISNAN
-- Performing Test HAVE_STD_ISNAN - Success
-- Performing Test HAVE_WORKING_STD_REGEX
-- Performing Test HAVE_WORKING_STD_REGEX - Success
-- Performing Test GCC_ATOMIC_BUILTINS_FOUND
-- Performing Test GCC_ATOMIC_BUILTINS_FOUND - Success
-- OpenMP: DISABLED
-- Performing Test HAS_NOWARN_UNUSED_TYPEDEFS
-- Performing Test HAS_NOWARN_UNUSED_TYPEDEFS - Success
-- Performing Test HAVE_STD_INDEX_SEQUENCE
-- Performing Test HAVE_STD_INDEX_SEQUENCE - Failed
-- Performing Test HAVE_STD_REMOVE_CV_T
-- Performing Test HAVE_STD_REMOVE_CV_T - Failed
-- Performing Test HAVE_STD_REMOVE_CVREF_T
-- Performing Test HAVE_STD_REMOVE_CVREF_T - Failed
-- Performing Test HAVE_STD_ENABLE_IF_T
-- Performing Test HAVE_STD_ENABLE_IF_T - Failed
-- Performing Test HAVE_STD_BOOL_CONSTANT
-- Performing Test HAVE_STD_BOOL_CONSTANT - Failed
-- Tests: ENABLED
-- DNS resolver: ENABLED
-- Looking for poll
-- Looking for poll - found
-- Looking for getopt
-- Looking for getopt - found
-- Looking for inet_ntop
-- Looking for inet_ntop - found
-- Looking for AF_INET6
-- Looking for AF_INET6 - found
-- Looking for windows.h
-- Looking for windows.h - not found
-- Library building mode: STATIC LIBRARIES
-- Performing Test COMPILER_HAS_HIDDEN_VISIBILITY
-- Performing Test COMPILER_HAS_HIDDEN_VISIBILITY - Success
-- Performing Test COMPILER_HAS_HIDDEN_INLINE_VISIBILITY
-- Performing Test COMPILER_HAS_HIDDEN_INLINE_VISIBILITY - Success
-- Performing Test COMPILER_HAS_DEPRECATED_ATTR
-- Performing Test COMPILER_HAS_DEPRECATED_ATTR - Success
-- Configuring done
-- Generating done
-- Build files have been written to: /home/elisa/fgfs/build/simgear
MAKE simgear
Scanning dependencies of target SimGearCore
[  0%] Building C object simgear/CMakeFiles/SimGearCore.dir/__/3rdparty/udns/udns_resolver.c.o
[  0%] Building C object simgear/CMakeFiles/SimGearCore.dir/__/3rdparty/udns/udns_parse.c.o
[  0%] Building C object simgear/CMakeFiles/SimGearCore.dir/__/3rdparty/udns/udns_init.c.o
[  0%] Building C object simgear/CMakeFiles/SimGearCore.dir/__/3rdparty/udns/udns_dntosp.c.o
[  1%] Building C object simgear/CMakeFiles/SimGearCore.dir/__/3rdparty/udns/udns_misc.c.o
[  2%] Building C object simgear/CMakeFiles/SimGearCore.dir/__/3rdparty/udns/udns_dn.c.o
[  2%] Building C object simgear/CMakeFiles/SimGearCore.dir/__/3rdparty/udns/udns_rr_a.c.o
[  2%] Building C object simgear/CMakeFiles/SimGearCore.dir/__/3rdparty/udns/udns_rr_ptr.c.o
[  2%] Building C object simgear/CMakeFiles/SimGearCore.dir/__/3rdparty/udns/udns_rr_mx.c.o
[  3%] Building C object simgear/CMakeFiles/SimGearCore.dir/__/3rdparty/udns/udns_rr_txt.c.o
[  3%] Building C object simgear/CMakeFiles/SimGearCore.dir/__/3rdparty/udns/udns_bl.c.o
[  3%] Building C object simgear/CMakeFiles/SimGearCore.dir/__/3rdparty/udns/udns_rr_srv.c.o
[  3%] Building C object simgear/CMakeFiles/SimGearCore.dir/__/3rdparty/udns/udns_rr_naptr.c.o
[  4%] Building C object simgear/CMakeFiles/SimGearCore.dir/__/3rdparty/udns/udns_codes.c.o
[  4%] Building C object simgear/CMakeFiles/SimGearCore.dir/__/3rdparty/udns/udns_jran.c.o
[  4%] Building C object simgear/CMakeFiles/SimGearCore.dir/__/3rdparty/udns/udns_XtoX.c.o
[  4%] Building CXX object simgear/CMakeFiles/SimGearCore.dir/bucket/newbucket.cxx.o
[  5%] Building CXX object simgear/CMakeFiles/SimGearCore.dir/bvh/BVHGroup.cxx.o
[  5%] Building CXX object simgear/CMakeFiles/SimGearCore.dir/bvh/BVHLineGeometry.cxx.o
[  5%] Building CXX object simgear/CMakeFiles/SimGearCore.dir/bvh/BVHLineSegmentVisitor.cxx.o
[  5%] Building CXX object simgear/CMakeFiles/SimGearCore.dir/bvh/BVHMotionTransform.cxx.o
[  6%] Building CXX object simgear/CMakeFiles/SimGearCore.dir/bvh/BVHNode.cxx.o
[  6%] Building CXX object simgear/CMakeFiles/SimGearCore.dir/bvh/BVHPageNode.cxx.o
[  6%] Building CXX object simgear/CMakeFiles/SimGearCore.dir/bvh/BVHPageRequest.cxx.o
[  7%] Building CXX object simgear/CMakeFiles/SimGearCore.dir/bvh/BVHPager.cxx.o
[  7%] Building CXX object simgear/CMakeFiles/SimGearCore.dir/bvh/BVHStaticBinary.cxx.o
[  7%] Building CXX object simgear/CMakeFiles/SimGearCore.dir/bvh/BVHStaticGeometry.cxx.o
[  7%] Building CXX object simgear/CMakeFiles/SimGearCore.dir/bvh/BVHStaticLeaf.cxx.o
[  8%] Building CXX object simgear/CMakeFiles/SimGearCore.dir/bvh/BVHStaticNode.cxx.o
[  8%] Building CXX object simgear/CMakeFiles/SimGearCore.dir/bvh/BVHStaticTriangle.cxx.o
[  8%] Building CXX object simgear/CMakeFiles/SimGearCore.dir/bvh/BVHSubTreeCollector.cxx.o
[  8%] Building CXX object simgear/CMakeFiles/SimGearCore.dir/bvh/BVHMaterial.cxx.o
[  9%] Building CXX object simgear/CMakeFiles/SimGearCore.dir/bvh/BVHTransform.cxx.o
[  9%] Building CXX object simgear/CMakeFiles/SimGearCore.dir/debug/logstream.cxx.o
[  9%] Building CXX object simgear/CMakeFiles/SimGearCore.dir/debug/BufferedLogCallback.cxx.o
[  9%] Building CXX object simgear/CMakeFiles/SimGearCore.dir/embedded_resources/EmbeddedResource.cxx.o
[ 10%] Building CXX object simgear/CMakeFiles/SimGearCore.dir/embedded_resources/EmbeddedResourceManager.cxx.o
[ 10%] Building CXX object simgear/CMakeFiles/SimGearCore.dir/embedded_resources/EmbeddedResourceProxy.cxx.o
[ 10%] Building CXX object simgear/CMakeFiles/SimGearCore.dir/ephemeris/celestialBody.cxx.o
[ 10%] Building CXX object simgear/CMakeFiles/SimGearCore.dir/ephemeris/ephemeris.cxx.o
[ 11%] Building CXX object simgear/CMakeFiles/SimGearCore.dir/ephemeris/jupiter.cxx.o
[ 11%] Building CXX object simgear/CMakeFiles/SimGearCore.dir/ephemeris/mars.cxx.o
[ 11%] Building CXX object simgear/CMakeFiles/SimGearCore.dir/ephemeris/mercury.cxx.o
[ 11%] Building CXX object simgear/CMakeFiles/SimGearCore.dir/ephemeris/moonpos.cxx.o
[ 12%] Building CXX object simgear/CMakeFiles/SimGearCore.dir/ephemeris/neptune.cxx.o
[ 12%] Building CXX object simgear/CMakeFiles/SimGearCore.dir/ephemeris/saturn.cxx.o
[ 12%] Building CXX object simgear/CMakeFiles/SimGearCore.dir/ephemeris/star.cxx.o
[ 12%] Building CXX object simgear/CMakeFiles/SimGearCore.dir/ephemeris/stardata.cxx.o
[ 13%] Building CXX object simgear/CMakeFiles/SimGearCore.dir/ephemeris/uranus.cxx.o
[ 13%] Building CXX object simgear/CMakeFiles/SimGearCore.dir/ephemeris/venus.cxx.o
[ 13%] Building CXX object simgear/CMakeFiles/SimGearCore.dir/io/iostreams/sgstream.cxx.o
[ 14%] Building CXX object simgear/CMakeFiles/SimGearCore.dir/io/iostreams/gzfstream.cxx.o
[ 14%] Building CXX object simgear/CMakeFiles/SimGearCore.dir/io/iostreams/gzcontainerfile.cxx.o
[ 14%] Building CXX object simgear/CMakeFiles/SimGearCore.dir/io/iostreams/CharArrayStream.cxx.o
[ 14%] Building CXX object simgear/CMakeFiles/SimGearCore.dir/io/iostreams/zlibstream.cxx.o
[ 15%] Building CXX object simgear/CMakeFiles/SimGearCore.dir/io/iochannel.cxx.o
[ 15%] Building CXX object simgear/CMakeFiles/SimGearCore.dir/io/lowlevel.cxx.o
[ 15%] Building CXX object simgear/CMakeFiles/SimGearCore.dir/io/raw_socket.cxx.o
[ 15%] Building CXX object simgear/CMakeFiles/SimGearCore.dir/io/sg_binobj.cxx.o
[ 16%] Building CXX object simgear/CMakeFiles/SimGearCore.dir/io/sg_file.cxx.o
[ 16%] Building CXX object simgear/CMakeFiles/SimGearCore.dir/io/sg_netBuffer.cxx.o
[ 16%] Building CXX object simgear/CMakeFiles/SimGearCore.dir/io/sg_netChannel.cxx.o
[ 16%] Building CXX object simgear/CMakeFiles/SimGearCore.dir/io/sg_netChat.cxx.o
[ 17%] Building CXX object simgear/CMakeFiles/SimGearCore.dir/io/sg_serial.cxx.o
[ 17%] Building CXX object simgear/CMakeFiles/SimGearCore.dir/io/sg_socket.cxx.o
[ 17%] Building CXX object simgear/CMakeFiles/SimGearCore.dir/io/sg_socket_udp.cxx.o
[ 17%] Building CXX object simgear/CMakeFiles/SimGearCore.dir/io/HTTPClient.cxx.o
[ 18%] Building CXX object simgear/CMakeFiles/SimGearCore.dir/io/HTTPFileRequest.cxx.o
[ 18%] Building CXX object simgear/CMakeFiles/SimGearCore.dir/io/HTTPMemoryRequest.cxx.o
[ 18%] Building CXX object simgear/CMakeFiles/SimGearCore.dir/io/HTTPRequest.cxx.o
[ 18%] Building CXX object simgear/CMakeFiles/SimGearCore.dir/io/HTTPRepository.cxx.o
[ 19%] Building CXX object simgear/CMakeFiles/SimGearCore.dir/io/untar.cxx.o
[ 19%] Building CXX object simgear/CMakeFiles/SimGearCore.dir/io/DNSClient.cxx.o
[ 19%] Building CXX object simgear/CMakeFiles/SimGearCore.dir/magvar/magvar.cxx.o
[ 20%] Building CXX object simgear/CMakeFiles/SimGearCore.dir/magvar/coremag.cxx.o
[ 20%] Building CXX object simgear/CMakeFiles/SimGearCore.dir/math/SGGeodesy.cxx.o
[ 20%] Building CXX object simgear/CMakeFiles/SimGearCore.dir/math/interpolater.cxx.o
[ 20%] Building CXX object simgear/CMakeFiles/SimGearCore.dir/math/leastsqs.cxx.o
[ 21%] Building C object simgear/CMakeFiles/SimGearCore.dir/math/sg_random.c.o
[ 21%] Building CXX object simgear/CMakeFiles/SimGearCore.dir/misc/CSSBorder.cxx.o
[ 21%] Building CXX object simgear/CMakeFiles/SimGearCore.dir/misc/ResourceManager.cxx.o
[ 21%] Building CXX object simgear/CMakeFiles/SimGearCore.dir/misc/SimpleMarkdown.cxx.o
[ 22%] Building CXX object simgear/CMakeFiles/SimGearCore.dir/misc/SVGpreserveAspectRatio.cxx.o
[ 22%] Building CXX object simgear/CMakeFiles/SimGearCore.dir/misc/argparse.cxx.o
[ 22%] Building CXX object simgear/CMakeFiles/SimGearCore.dir/misc/interpolator.cxx.o
[ 22%] Building CXX object simgear/CMakeFiles/SimGearCore.dir/misc/sg_dir.cxx.o
[ 23%] Building CXX object simgear/CMakeFiles/SimGearCore.dir/misc/sg_path.cxx.o
[ 23%] Building CXX object simgear/CMakeFiles/SimGearCore.dir/misc/sg_hash.cxx.o
[ 23%] Building CXX object simgear/CMakeFiles/SimGearCore.dir/misc/strutils.cxx.o
[ 23%] Building CXX object simgear/CMakeFiles/SimGearCore.dir/misc/tabbed_values.cxx.o
[ 24%] Building CXX object simgear/CMakeFiles/SimGearCore.dir/misc/texcoord.cxx.o
[ 24%] Building C object simgear/CMakeFiles/SimGearCore.dir/nasal/bitslib.c.o
[ 24%] Building C object simgear/CMakeFiles/SimGearCore.dir/nasal/code.c.o
[ 24%] Building C object simgear/CMakeFiles/SimGearCore.dir/nasal/codegen.c.o
[ 25%] Building C object simgear/CMakeFiles/SimGearCore.dir/nasal/gc.c.o
[ 25%] Building C object simgear/CMakeFiles/SimGearCore.dir/nasal/hash.c.o
[ 25%] Building C object simgear/CMakeFiles/SimGearCore.dir/nasal/iolib.c.o
[ 25%] Building C object simgear/CMakeFiles/SimGearCore.dir/nasal/lex.c.o
[ 26%] Building C object simgear/CMakeFiles/SimGearCore.dir/nasal/lib.c.o
[ 26%] Building C object simgear/CMakeFiles/SimGearCore.dir/nasal/mathlib.c.o
[ 26%] Building C object simgear/CMakeFiles/SimGearCore.dir/nasal/misc.c.o
[ 27%] Building C object simgear/CMakeFiles/SimGearCore.dir/nasal/parse.c.o
[ 27%] Building C object simgear/CMakeFiles/SimGearCore.dir/nasal/string.c.o
[ 27%] Building C object simgear/CMakeFiles/SimGearCore.dir/nasal/thread-posix.c.o
[ 27%] Building C object simgear/CMakeFiles/SimGearCore.dir/nasal/thread-win32.c.o
[ 28%] Building C object simgear/CMakeFiles/SimGearCore.dir/nasal/threadlib.c.o
[ 28%] Building C object simgear/CMakeFiles/SimGearCore.dir/nasal/utf8lib.c.o
[ 28%] Building CXX object simgear/CMakeFiles/SimGearCore.dir/nasal/cppbind/Ghost.cxx.o
[ 28%] Building C object simgear/CMakeFiles/SimGearCore.dir/nasal/vector.c.o
[ 29%] Building CXX object simgear/CMakeFiles/SimGearCore.dir/nasal/cppbind/NasalContext.cxx.o
[ 29%] Building CXX object simgear/CMakeFiles/SimGearCore.dir/nasal/cppbind/NasalHash.cxx.o
[ 29%] Building CXX object simgear/CMakeFiles/SimGearCore.dir/nasal/cppbind/NasalString.cxx.o
[ 29%] Building CXX object simgear/CMakeFiles/SimGearCore.dir/nasal/cppbind/NasalObject.cxx.o
[ 30%] Building CXX object simgear/CMakeFiles/SimGearCore.dir/nasal/cppbind/detail/from_nasal_helper.cxx.o
[ 30%] Building CXX object simgear/CMakeFiles/SimGearCore.dir/nasal/cppbind/detail/to_nasal_helper.cxx.o
[ 30%] Building CXX object simgear/CMakeFiles/SimGearCore.dir/props/AtomicChangeListener.cxx.o
[ 30%] Building CXX object simgear/CMakeFiles/SimGearCore.dir/props/condition.cxx.o
[ 31%] Building CXX object simgear/CMakeFiles/SimGearCore.dir/props/easing_functions.cxx.o
[ 31%] Building CXX object simgear/CMakeFiles/SimGearCore.dir/props/PropertyBasedElement.cxx.o
[ 31%] Building CXX object simgear/CMakeFiles/SimGearCore.dir/props/PropertyBasedMgr.cxx.o
[ 31%] Building CXX object simgear/CMakeFiles/SimGearCore.dir/props/PropertyInterpolationMgr.cxx.o
[ 32%] Building CXX object simgear/CMakeFiles/SimGearCore.dir/props/PropertyInterpolator.cxx.o
[ 32%] Building CXX object simgear/CMakeFiles/SimGearCore.dir/props/propertyObject.cxx.o
[ 32%] Building CXX object simgear/CMakeFiles/SimGearCore.dir/props/props.cxx.o
[ 32%] Building CXX object simgear/CMakeFiles/SimGearCore.dir/props/props_io.cxx.o
[ 33%] Building CXX object simgear/CMakeFiles/SimGearCore.dir/serial/serial.cxx.o
[ 33%] Building CXX object simgear/CMakeFiles/SimGearCore.dir/structure/SGAtomic.cxx.o
[ 33%] Building CXX object simgear/CMakeFiles/SimGearCore.dir/structure/SGBinding.cxx.o
[ 34%] Building CXX object simgear/CMakeFiles/SimGearCore.dir/structure/SGExpression.cxx.o
[ 34%] Building CXX object simgear/CMakeFiles/SimGearCore.dir/structure/SGSmplhist.cxx.o
[ 34%] Building CXX object simgear/CMakeFiles/SimGearCore.dir/structure/SGSmplstat.cxx.o
[ 34%] Building CXX object simgear/CMakeFiles/SimGearCore.dir/structure/SGPerfMon.cxx.o
[ 35%] Building CXX object simgear/CMakeFiles/SimGearCore.dir/structure/StringTable.cxx.o
[ 35%] Building CXX object simgear/CMakeFiles/SimGearCore.dir/structure/commands.cxx.o
[ 35%] Building CXX object simgear/CMakeFiles/SimGearCore.dir/structure/event_mgr.cxx.o
[ 35%] Building CXX object simgear/CMakeFiles/SimGearCore.dir/structure/exception.cxx.o
[ 36%] Building CXX object simgear/CMakeFiles/SimGearCore.dir/structure/subsystem_mgr.cxx.o
[ 36%] Building CXX object simgear/CMakeFiles/SimGearCore.dir/structure/StateMachine.cxx.o
[ 36%] Building CXX object simgear/CMakeFiles/SimGearCore.dir/threads/SGThread.cxx.o
[ 36%] Building CXX object simgear/CMakeFiles/SimGearCore.dir/timing/lowleveltime.cxx.o
[ 37%] Building CXX object simgear/CMakeFiles/SimGearCore.dir/timing/sg_time.cxx.o
[ 37%] Building CXX object simgear/CMakeFiles/SimGearCore.dir/timing/timestamp.cxx.o
[ 37%] Building CXX object simgear/CMakeFiles/SimGearCore.dir/timing/timezone.cxx.o
[ 37%] Building CXX object simgear/CMakeFiles/SimGearCore.dir/xml/easyxml.cxx.o
[ 38%] Building CXX object simgear/CMakeFiles/SimGearCore.dir/package/Catalog.cxx.o
[ 38%] Building CXX object simgear/CMakeFiles/SimGearCore.dir/package/Package.cxx.o
[ 38%] Building CXX object simgear/CMakeFiles/SimGearCore.dir/package/Install.cxx.o
[ 38%] Building CXX object simgear/CMakeFiles/SimGearCore.dir/package/Root.cxx.o
/home/elisa/fgfs/simgear/simgear/structure/subsystem_mgr.cxx:1435:10: warning: ‘void {anonymous}::registerSubsystemCommands()’ defined but not used [-Wunused-function]
     void registerSubsystemCommands()
          ^
[ 39%] Building CXX object simgear/CMakeFiles/SimGearCore.dir/package/Delegate.cxx.o
[ 39%] Building C object simgear/CMakeFiles/SimGearCore.dir/package/md5.c.o
[ 39%] Building C object simgear/CMakeFiles/SimGearCore.dir/package/ioapi.c.o
[ 40%] Building C object simgear/CMakeFiles/SimGearCore.dir/package/ioapi_mem.c.o
[ 40%] Building C object simgear/CMakeFiles/SimGearCore.dir/package/unzip.c.o
[ 40%] Building CXX object simgear/CMakeFiles/SimGearCore.dir/scene/tsync/terrasync.cxx.o
[ 40%] Building C object simgear/CMakeFiles/SimGearCore.dir/__/3rdparty/expat/hashtable.c.o
[ 41%] Building C object simgear/CMakeFiles/SimGearCore.dir/__/3rdparty/expat/xmlparse.c.o
[ 41%] Building C object simgear/CMakeFiles/SimGearCore.dir/__/3rdparty/expat/xmlrole.c.o
[ 41%] Building C object simgear/CMakeFiles/SimGearCore.dir/__/3rdparty/expat/xmltok.c.o
[ 41%] Linking CXX static library libSimGearCore.a
[ 41%] Built target SimGearCore
Scanning dependencies of target test_magvar
Scanning dependencies of target bvhtest
[ 41%] Building CXX object simgear/magvar/CMakeFiles/test_magvar.dir/testmagvar.cxx.o
[ 41%] Building CXX object simgear/bvh/CMakeFiles/bvhtest.dir/bvhtest.cxx.o
[ 42%] Linking CXX executable test_magvar
Scanning dependencies of target SimGearScene
[ 42%] Built target test_magvar
[ 42%] Building C object simgear/CMakeFiles/SimGearScene.dir/canvas/ShivaVG/src/shContext.c.o
[ 42%] Building C object simgear/CMakeFiles/SimGearScene.dir/canvas/ShivaVG/src/shGeometry.c.o
[ 42%] Building C object simgear/CMakeFiles/SimGearScene.dir/canvas/ShivaVG/src/shExtensions.c.o
[ 43%] Building C object simgear/CMakeFiles/SimGearScene.dir/canvas/ShivaVG/src/shArrays.c.o
[ 44%] Building C object simgear/CMakeFiles/SimGearScene.dir/canvas/ShivaVG/src/shImage.c.o
[ 44%] Building C object simgear/CMakeFiles/SimGearScene.dir/canvas/ShivaVG/src/shPaint.c.o
[ 44%] Building C object simgear/CMakeFiles/SimGearScene.dir/canvas/ShivaVG/src/shParams.c.o
[ 44%] Building C object simgear/CMakeFiles/SimGearScene.dir/canvas/ShivaVG/src/shPath.c.o
[ 45%] Building C object simgear/CMakeFiles/SimGearScene.dir/canvas/ShivaVG/src/shPipeline.c.o
[ 45%] Building C object simgear/CMakeFiles/SimGearScene.dir/canvas/ShivaVG/src/shVectors.c.o
[ 45%] Building C object simgear/CMakeFiles/SimGearScene.dir/canvas/ShivaVG/src/shVgu.c.o
[ 45%] Building CXX object simgear/CMakeFiles/SimGearScene.dir/canvas/elements/CanvasElement.cxx.o
[ 46%] Building CXX object simgear/CMakeFiles/SimGearScene.dir/canvas/elements/CanvasGroup.cxx.o
[ 46%] Building CXX object simgear/CMakeFiles/SimGearScene.dir/canvas/elements/CanvasImage.cxx.o
[ 46%] Building CXX object simgear/CMakeFiles/SimGearScene.dir/canvas/elements/CanvasMap.cxx.o
[ 46%] Building CXX object simgear/CMakeFiles/SimGearScene.dir/canvas/elements/CanvasPath.cxx.o
[ 47%] Linking CXX executable bvhtest
[ 47%] Built target bvhtest
[ 48%] Building CXX object simgear/CMakeFiles/SimGearScene.dir/canvas/elements/CanvasText.cxx.o
/home/elisa/fgfs/simgear/simgear/canvas/elements/CanvasText.cxx: In member function ‘osg::Vec2 simgear::canvas::TextLine::cursorPos(size_t) const’:
/home/elisa/fgfs/simgear/simgear/canvas/elements/CanvasText.cxx:175:34: warning: unused variable ‘coords’ [-Wunused-variable]
       GlyphQuads::Coords2 const& coords = _quads->_coords;
                                  ^
/home/elisa/fgfs/simgear/simgear/canvas/elements/CanvasText.cxx: In member function ‘osg::Vec2 simgear::canvas::TextLine::nearestCursor(float) const’:
/home/elisa/fgfs/simgear/simgear/canvas/elements/CanvasText.cxx:214:31: warning: unused variable ‘glyphs’ [-Wunused-variable]
     GlyphQuads::Glyphs const& glyphs = _quads->_glyphs;
                               ^
/home/elisa/fgfs/simgear/simgear/canvas/elements/CanvasText.cxx:216:32: warning: unused variable ‘coords’ [-Wunused-variable]
     GlyphQuads::Coords2 const& coords = _quads->_coords;
                                ^
[ 48%] Building CXX object simgear/CMakeFiles/SimGearScene.dir/canvas/events/CustomEvent.cxx.o
/home/elisa/fgfs/simgear/simgear/canvas/elements/CanvasText.cxx:244:3: warning: control reaches end of non-void function [-Wreturn-type]
   }
   ^
[ 48%] Building CXX object simgear/CMakeFiles/SimGearScene.dir/canvas/events/DeviceEvent.cxx.o
[ 49%] Building CXX object simgear/CMakeFiles/SimGearScene.dir/canvas/events/KeyboardEvent.cxx.o
[ 49%] Building CXX object simgear/CMakeFiles/SimGearScene.dir/canvas/events/MouseEvent.cxx.o
[ 49%] Building CXX object simgear/CMakeFiles/SimGearScene.dir/canvas/layout/BoxLayout.cxx.o
[ 49%] Building CXX object simgear/CMakeFiles/SimGearScene.dir/canvas/layout/Layout.cxx.o
[ 50%] Building CXX object simgear/CMakeFiles/SimGearScene.dir/canvas/layout/LayoutItem.cxx.o
[ 50%] Building CXX object simgear/CMakeFiles/SimGearScene.dir/canvas/layout/NasalWidget.cxx.o
[ 50%] Building CXX object simgear/CMakeFiles/SimGearScene.dir/canvas/layout/SpacerItem.cxx.o
[ 50%] Building CXX object simgear/CMakeFiles/SimGearScene.dir/canvas/Canvas.cxx.o
[ 51%] Building CXX object simgear/CMakeFiles/SimGearScene.dir/canvas/CanvasEvent.cxx.o
[ 51%] Building CXX object simgear/CMakeFiles/SimGearScene.dir/canvas/CanvasEventManager.cxx.o
[ 51%] Building CXX object simgear/CMakeFiles/SimGearScene.dir/canvas/CanvasEventVisitor.cxx.o
[ 51%] Building CXX object simgear/CMakeFiles/SimGearScene.dir/canvas/CanvasMgr.cxx.o
[ 52%] Building CXX object simgear/CMakeFiles/SimGearScene.dir/canvas/CanvasObjectPlacement.cxx.o
[ 52%] Building CXX object simgear/CMakeFiles/SimGearScene.dir/canvas/CanvasPlacement.cxx.o
[ 52%] Building CXX object simgear/CMakeFiles/SimGearScene.dir/canvas/CanvasWindow.cxx.o
[ 52%] Building CXX object simgear/CMakeFiles/SimGearScene.dir/canvas/ODGauge.cxx.o
[ 53%] Building CXX object simgear/CMakeFiles/SimGearScene.dir/canvas/VGInitOperation.cxx.o
[ 53%] Building CXX object simgear/CMakeFiles/SimGearScene.dir/environment/metar.cxx.o
[ 53%] Building CXX object simgear/CMakeFiles/SimGearScene.dir/environment/precipitation.cxx.o
[ 53%] Building CXX object simgear/CMakeFiles/SimGearScene.dir/screen/extensions.cxx.o
[ 54%] Building CXX object simgear/CMakeFiles/SimGearScene.dir/screen/screen-dump.cxx.o
[ 54%] Building CXX object simgear/CMakeFiles/SimGearScene.dir/screen/tr.cxx.o
[ 54%] Building CXX object simgear/CMakeFiles/SimGearScene.dir/scene/material/Effect.cxx.o
[ 54%] Building CXX object simgear/CMakeFiles/SimGearScene.dir/scene/material/EffectBuilder.cxx.o
[ 55%] Building CXX object simgear/CMakeFiles/SimGearScene.dir/scene/material/EffectCullVisitor.cxx.o
[ 55%] Building CXX object simgear/CMakeFiles/SimGearScene.dir/scene/material/EffectGeode.cxx.o
[ 55%] Building CXX object simgear/CMakeFiles/SimGearScene.dir/scene/material/Pass.cxx.o
[ 56%] Building CXX object simgear/CMakeFiles/SimGearScene.dir/scene/material/Technique.cxx.o
[ 56%] Building CXX object simgear/CMakeFiles/SimGearScene.dir/scene/material/TextureBuilder.cxx.o
[ 56%] Building CXX object simgear/CMakeFiles/SimGearScene.dir/scene/material/makeEffect.cxx.o
[ 56%] Building CXX object simgear/CMakeFiles/SimGearScene.dir/scene/material/mat.cxx.o
[ 57%] Building CXX object simgear/CMakeFiles/SimGearScene.dir/scene/material/matlib.cxx.o
[ 57%] Building CXX object simgear/CMakeFiles/SimGearScene.dir/scene/material/matmodel.cxx.o
[ 57%] Building CXX object simgear/CMakeFiles/SimGearScene.dir/scene/material/mipmap.cxx.o
[ 57%] Building CXX object simgear/CMakeFiles/SimGearScene.dir/scene/material/parseBlendFunc.cxx.o
[ 58%] Building CXX object simgear/CMakeFiles/SimGearScene.dir/scene/model/BVHPageNodeOSG.cxx.o
[ 58%] Building CXX object simgear/CMakeFiles/SimGearScene.dir/scene/model/CheckSceneryVisitor.cxx.o
[ 58%] Building CXX object simgear/CMakeFiles/SimGearScene.dir/scene/model/ConditionNode.cxx.o
[ 58%] Building CXX object simgear/CMakeFiles/SimGearScene.dir/scene/model/ModelRegistry.cxx.o
[ 59%] Building CXX object simgear/CMakeFiles/SimGearScene.dir/scene/model/PrimitiveCollector.cxx.o
[ 59%] Building CXX object simgear/CMakeFiles/SimGearScene.dir/scene/model/SGClipGroup.cxx.o
[ 59%] Building CXX object simgear/CMakeFiles/SimGearScene.dir/scene/model/SGInteractionAnimation.cxx.o
[ 59%] Building CXX object simgear/CMakeFiles/SimGearScene.dir/scene/model/SGLightAnimation.cxx.o
[ 60%] Building CXX object simgear/CMakeFiles/SimGearScene.dir/scene/model/SGPickAnimation.cxx.o
[ 60%] Building CXX object simgear/CMakeFiles/SimGearScene.dir/scene/model/SGMaterialAnimation.cxx.o
[ 60%] Building CXX object simgear/CMakeFiles/SimGearScene.dir/scene/model/SGOffsetTransform.cxx.o
[ 60%] Building CXX object simgear/CMakeFiles/SimGearScene.dir/scene/model/SGReaderWriterXML.cxx.o
[ 61%] Building CXX object simgear/CMakeFiles/SimGearScene.dir/scene/model/SGRotateTransform.cxx.o
[ 61%] Building CXX object simgear/CMakeFiles/SimGearScene.dir/scene/model/SGScaleTransform.cxx.o
[ 61%] Building CXX object simgear/CMakeFiles/SimGearScene.dir/scene/model/SGText.cxx.o
[ 62%] Building CXX object simgear/CMakeFiles/SimGearScene.dir/scene/model/SGTrackToAnimation.cxx.o
[ 62%] Building CXX object simgear/CMakeFiles/SimGearScene.dir/scene/model/SGTranslateTransform.cxx.o
[ 62%] Building CXX object simgear/CMakeFiles/SimGearScene.dir/scene/model/animation.cxx.o
[ 62%] Building CXX object simgear/CMakeFiles/SimGearScene.dir/scene/model/model.cxx.o
[ 63%] Building CXX object simgear/CMakeFiles/SimGearScene.dir/scene/model/modellib.cxx.o
[ 63%] Building CXX object simgear/CMakeFiles/SimGearScene.dir/scene/model/particles.cxx.o
[ 63%] Building CXX object simgear/CMakeFiles/SimGearScene.dir/scene/model/persparam.cxx.o
[ 63%] Building CXX object simgear/CMakeFiles/SimGearScene.dir/scene/model/placement.cxx.o
[ 64%] Building CXX object simgear/CMakeFiles/SimGearScene.dir/scene/model/shadanim.cxx.o
[ 64%] Building CXX object simgear/CMakeFiles/SimGearScene.dir/scene/sky/CloudShaderGeometry.cxx.o
[ 64%] Building CXX object simgear/CMakeFiles/SimGearScene.dir/scene/sky/cloud.cxx.o
[ 64%] Building CXX object simgear/CMakeFiles/SimGearScene.dir/scene/sky/cloudfield.cxx.o
[ 65%] Building CXX object simgear/CMakeFiles/SimGearScene.dir/scene/sky/dome.cxx.o
[ 65%] Building CXX object simgear/CMakeFiles/SimGearScene.dir/scene/sky/moon.cxx.o
[ 65%] Building CXX object simgear/CMakeFiles/SimGearScene.dir/scene/sky/newcloud.cxx.o
[ 65%] Building CXX object simgear/CMakeFiles/SimGearScene.dir/scene/sky/oursun.cxx.o
[ 66%] Building CXX object simgear/CMakeFiles/SimGearScene.dir/scene/sky/sky.cxx.o
[ 66%] Building CXX object simgear/CMakeFiles/SimGearScene.dir/scene/sky/sphere.cxx.o
[ 66%] Building CXX object simgear/CMakeFiles/SimGearScene.dir/scene/sky/stars.cxx.o
[ 66%] Building CXX object simgear/CMakeFiles/SimGearScene.dir/scene/tgdb/GroundLightManager.cxx.o
[ 67%] Building CXX object simgear/CMakeFiles/SimGearScene.dir/scene/tgdb/ReaderWriterSPT.cxx.o
[ 67%] Building CXX object simgear/CMakeFiles/SimGearScene.dir/scene/tgdb/ReaderWriterSTG.cxx.o
[ 67%] Building CXX object simgear/CMakeFiles/SimGearScene.dir/scene/tgdb/SGBuildingBin.cxx.o
[ 67%] Building CXX object simgear/CMakeFiles/SimGearScene.dir/scene/tgdb/SGOceanTile.cxx.o
[ 68%] Building CXX object simgear/CMakeFiles/SimGearScene.dir/scene/tgdb/SGReaderWriterBTG.cxx.o
[ 68%] Building CXX object simgear/CMakeFiles/SimGearScene.dir/scene/tgdb/SGVasiDrawable.cxx.o
[ 68%] Building CXX object simgear/CMakeFiles/SimGearScene.dir/scene/tgdb/ShaderGeometry.cxx.o
[ 69%] Building CXX object simgear/CMakeFiles/SimGearScene.dir/scene/tgdb/TreeBin.cxx.o
[ 69%] Building CXX object simgear/CMakeFiles/SimGearScene.dir/scene/tgdb/apt_signs.cxx.o
[ 69%] Building CXX object simgear/CMakeFiles/SimGearScene.dir/scene/tgdb/obj.cxx.o
[ 69%] Building CXX object simgear/CMakeFiles/SimGearScene.dir/scene/tgdb/pt_lights.cxx.o
[ 70%] Building CXX object simgear/CMakeFiles/SimGearScene.dir/scene/tgdb/userdata.cxx.o
[ 70%] Building CXX object simgear/CMakeFiles/SimGearScene.dir/scene/util/ColorInterpolator.cxx.o
[ 70%] Building CXX object simgear/CMakeFiles/SimGearScene.dir/scene/util/CopyOp.cxx.o
[ 70%] Building CXX object simgear/CMakeFiles/SimGearScene.dir/scene/util/DeletionManager.cxx.o
[ 71%] Building CXX object simgear/CMakeFiles/SimGearScene.dir/scene/util/NodeAndDrawableVisitor.cxx.o
[ 71%] Building CXX object simgear/CMakeFiles/SimGearScene.dir/scene/util/Noise.cxx.o
[ 71%] Building CXX object simgear/CMakeFiles/SimGearScene.dir/scene/util/OptionsReadFileCallback.cxx.o
[ 71%] Building CXX object simgear/CMakeFiles/SimGearScene.dir/scene/util/OsgDebug.cxx.o
[ 72%] Building CXX object simgear/CMakeFiles/SimGearScene.dir/scene/util/parse_color.cxx.o
[ 72%] Building CXX object simgear/CMakeFiles/SimGearScene.dir/scene/util/PrimitiveUtils.cxx.o
[ 72%] Building CXX object simgear/CMakeFiles/SimGearScene.dir/scene/util/QuadTreeBuilder.cxx.o
[ 72%] Building CXX object simgear/CMakeFiles/SimGearScene.dir/scene/util/SGEnlargeBoundingBox.cxx.o
[ 73%] Building CXX object simgear/CMakeFiles/SimGearScene.dir/scene/util/SGImageUtils.cxx.o
[ 73%] Building CXX object simgear/CMakeFiles/SimGearScene.dir/scene/util/SGReaderWriterOptions.cxx.o
[ 73%] Building CXX object simgear/CMakeFiles/SimGearScene.dir/scene/util/SGSceneFeatures.cxx.o
[ 73%] Building CXX object simgear/CMakeFiles/SimGearScene.dir/scene/util/SGSceneUserData.cxx.o
[ 74%] Building CXX object simgear/CMakeFiles/SimGearScene.dir/scene/util/SGStateAttributeVisitor.cxx.o
[ 74%] Building CXX object simgear/CMakeFiles/SimGearScene.dir/scene/util/SGTextureStateAttributeVisitor.cxx.o
/home/elisa/fgfs/simgear/simgear/scene/util/SGImageUtils.cxx: In static member function ‘static void simgear::{anonymous}::ColorWriter<32818, unsigned char>::write(const simgear::ImageUtils::PixelWriter*, const osg::Vec4f&, int, int, int, int)’:
/home/elisa/fgfs/simgear/simgear/scene/util/SGImageUtils.cxx:1815:22: warning: unused variable ‘ptr’ [-Wunused-variable]
             GLubyte* ptr = (GLubyte*)iw->data(s, t, r, m);
                      ^
[ 74%] Building CXX object simgear/CMakeFiles/SimGearScene.dir/scene/util/SplicingVisitor.cxx.o
[ 74%] Building CXX object simgear/CMakeFiles/SimGearScene.dir/scene/util/StateAttributeFactory.cxx.o
[ 75%] Building CXX object simgear/CMakeFiles/SimGearScene.dir/scene/util/UpdateOnceCallback.cxx.o
[ 75%] Building CXX object simgear/CMakeFiles/SimGearScene.dir/scene/util/project.cxx.o
[ 75%] Building CXX object simgear/CMakeFiles/SimGearScene.dir/scene/viewer/ClusteredForward.cxx.o
[ 76%] Building CXX object simgear/CMakeFiles/SimGearScene.dir/scene/viewer/Compositor.cxx.o
[ 76%] Building CXX object simgear/CMakeFiles/SimGearScene.dir/scene/viewer/CompositorBuffer.cxx.o
[ 76%] Building CXX object simgear/CMakeFiles/SimGearScene.dir/scene/viewer/CompositorPass.cxx.o
[ 76%] Building CXX object simgear/CMakeFiles/SimGearScene.dir/scene/viewer/CompositorUtil.cxx.o
[ 77%] Building CXX object simgear/CMakeFiles/SimGearScene.dir/sound/sample.cxx.o
[ 77%] Building CXX object simgear/CMakeFiles/SimGearScene.dir/sound/sample_group.cxx.o
[ 77%] Building CXX object simgear/CMakeFiles/SimGearScene.dir/sound/xmlsound.cxx.o
/home/elisa/fgfs/simgear/simgear/scene/viewer/Compositor.cxx: In member function ‘void simgear::compositor::Compositor::resized()’:
/home/elisa/fgfs/simgear/simgear/scene/viewer/Compositor.cxx:198:17: error: ‘class osg::Camera’ has no member named ‘resize’
         camera->resize(pass->viewport_width_scale  * _viewport->width(),
                 ^
[ 77%] Building CXX object simgear/CMakeFiles/SimGearScene.dir/sound/filters.cxx.o
[ 78%] Building CXX object simgear/CMakeFiles/SimGearScene.dir/sound/soundmgr_openal.cxx.o
simgear/CMakeFiles/SimGearScene.dir/build.make:3014 : la recette pour la cible « simgear/CMakeFiles/SimGearScene.dir/scene/viewer/Compositor.cxx.o » a échouée
make[2]: *** [simgear/CMakeFiles/SimGearScene.dir/scene/viewer/Compositor.cxx.o] Erreur 1
make[2]: *** Attente des tâches non terminées....
CMakeFiles/Makefile2:1180 : la recette pour la cible « simgear/CMakeFiles/SimGearScene.dir/all » a échouée
make[1]: *** [simgear/CMakeFiles/SimGearScene.dir/all] Erreur 2
Makefile:160 : la recette pour la cible « all » a échouée
make: *** [all] Erreur 2
INSTALL simgear
[ 41%] Built target SimGearCore
[ 42%] Building CXX object simgear/CMakeFiles/SimGearScene.dir/scene/viewer/Compositor.cxx.o
/home/elisa/fgfs/simgear/simgear/scene/viewer/Compositor.cxx: In member function ‘void simgear::compositor::Compositor::resized()’:
/home/elisa/fgfs/simgear/simgear/scene/viewer/Compositor.cxx:198:17: error: ‘class osg::Camera’ has no member named ‘resize’
         camera->resize(pass->viewport_width_scale  * _viewport->width(),
                 ^
simgear/CMakeFiles/SimGearScene.dir/build.make:3014 : la recette pour la cible « simgear/CMakeFiles/SimGearScene.dir/scene/viewer/Compositor.cxx.o » a échouée
make[2]: *** [simgear/CMakeFiles/SimGearScene.dir/scene/viewer/Compositor.cxx.o] Erreur 1
CMakeFiles/Makefile2:1180 : la recette pour la cible « simgear/CMakeFiles/SimGearScene.dir/all » a échouée
make[1]: *** [simgear/CMakeFiles/SimGearScene.dir/all] Erreur 2
Makefile:160 : la recette pour la cible « all » a échouée
make: *** [all] Erreur 2

Je n'ai surtout pas cherché à comprendre comment on pouvait corriger les erreurs, mon but étant uniquement de savoir si la compilation marchait en LM18 ou en LM19.

J'ai donc décidé de migrer immédiatement mon poste en LM19 Tara.
Et là je suis tombé sur une grosse galère.
Qui fait que Clm76 n'a pas forcément tort de se méfier...
En effet LM18.3 Sylvia est si j'ai bien compris (je ne suis pas du tout ni un adepte ni un connaisseur de Linux Mint), une version supportée à long terme, jusqu'en 2021.
Pauvres utilisateurs de Linux Mint qui veulent compiler, si ça ne compile déjà pas en 2019, qu'est-ce que ça sera en 2021 !
Et donc Linux Mint 18.3 ne propose pas d'outil graphique pour migrer en LM19 (en tout cas je ne l'ai pas trouvé).
Il le proposera sûrement mais à priori c'est trop tôt pas rapport à la durée de vie de LM18.3 .
La seule façon semble être de faire la migration en ligne de commande avec la commande mintupgrade.
Et ce ne doit pas être facile pour quelqu'un qui n'est pas très initié.
En effet mintupgrade refuse de fonctionner si l'on a pas au préalable généré un snapshot avec l'utilitaire Timeshift (qu'il faut donc installer et exécuter).
Ceci fait, mintugrade ne fonctionne toujours pas, car le Display Manager de Sylvia (MDM), n'est plus supporté par Tara, et il faut switcher sur LightDM (à installer aussi).
Donc tout ça n'est quand même pas ultra simple.
Là, mintupgrade fonctionne.
Il y avait pour moi quelque 2000 paquets à mettre à jour !
Et ce qui peut arriver est arrivé, la mise à jour a planté sur la configuration de linux-headers-4.15 .
Pourquoi ? Il n'y a à priori pas de raison, mais quelquefois un petit grain de sable suffit à gripper la machine.
Fort heureusement, c'était presque à la fin de la mise à jour.
Si bien que mon PC a accepté de rebooter (à l'arrache).
Mais il ne fonctionnait qu'en mode de secours (un écran avec des icônes énormes, du 800 x 600 ou 640 x 480).
Et pas de console en mode secours.
J'ai donc switché de l'interface graphique en écran de commande ( Ctrl + Alt + F1 ).
Et là (après login et mdp), j'ai pu terminer la configuration à partir de l'endroit où elle avait échoué à l'aide de la commande dpkg --configure -a .

Et après reboot, je me suis retrouvé avec un bel LM19 Tara.
Mais sur le coup j'ai eu chaud aux plumes, j'aurais pu casser mon système.
Ce n'aurait pas été grave pour un poste de test, mais pour Clm76 ou d'autres ça l'aurait sûrement été plus.

Enfin, fin du test, en lançant la compilation, SIMGEAR et FGFS compilent parfaitement, pas la moindre erreur.
Par contre pour le DATA j'ai toujours l'erreur de la fin de fichier prématurée.
Mais je ne sais plus où il faut changer l'adresse de serveur, faut que je recherche.

Donc ma conclusion : qu'est-ce qu'on est bien en Debian testing !


André. anciennement taureau89_9
Debian Testing Amd64. CM Sabertooth 990FX, FX8350, 32 Go Ram DDR3 1866 Mhz, GTX 750ti 2Go, DD 2To Sata 3, THRUSTMASTER T.Flight StickX, FG 2019.2.0 Git.

Hors ligne

#35 23/03/2019 0:35:26

ctesc356
Membre
Inscription : 18/05/2010
Messages : 2 715

Re : Erreur compilation FGFS

Bonsoir,
on fait ses petites expériences wink

Pour compiler simgear en 2019.2.0 il faut osg 3.4, ça c'est aquis.
Donc avec Mint18.3 il faut compiler osg, c'est prévu dans d&c...

Pour l'erreur que rencontre Clm76 à compiler fgfs...
Sur le pc d'un voisin que j'avais installé en Mint18.3, et qui était vierge de fg, ça passe, sur un Mint18.3 que j'ai installé ici en vm ça passe aussi.
Alors mystère...

Il faut passer en 19.1, mais en réinstall propre, pas de upgrade qui foire une fois sur deux.
Ici j'ai tout ce qui ne concerne pas le système sur des partitions à part: /media/machin/truc, quelques liens qui vont bien dans le home et c'est transparent, les données sont accessibles depuis tous les linux installés (Debian, Mint, Kali en ce moment).

Dernière modification par ctesc356 (23/03/2019 1:19:34)


Intel i5 3570 3.4Mhz, Nvidia GTX 660, 8Go Ram, Linux Mint

Hors ligne

#36 23/03/2019 11:33:05

Patten
Membre
Lieu : LFLR
Inscription : 14/12/2010
Messages : 1 657
Site Web

Re : Erreur compilation FGFS

Bonjour à tous,

ctesc356 a écrit :

...........

Il faut passer en 19.1, mais en réinstall propre, pas de upgrade qui foire une fois sur deux.
............

+le milliard, surtout vers une version en N° impair. roll

C'est pas d'actualité pour moi, de toute façon, avec le débit internet que j'ai depuis quelques temps, le temps de télécharger l'image iso de LM19, on serait sans doute à la version LM20. big_smile

smile


Intel I7.7700k 4.2 GHz 4 C 8 tr.MSI Gaming pro.MSI GTX 1080 Armor 8Go.Ram:16Go DDR4 GSKILL 3000Mhz.Stock:2*480Go SSD Kingston UV 400+2*2T HDD Seagate Baracuda.Alim:Corsair RM750X 80Plus Gold.Ventirad Be quiet pure rock.Boîtier Aérocool GT-S black édition.DVD Asus drw-24f1-mt. Wifi + Bluetooth gigabyte.Dual boot LinuxMint 18.3 Sylvia/Windows10 FG2019.2
http://pattenflightgear.wifeo.com/

Hors ligne

#37 23/03/2019 12:00:19

f-toro
Administrateur
Lieu : LFLA
Inscription : 16/12/2007
Messages : 2 511

Re : Erreur compilation FGFS

@ ctesc356

Ta réponse ne m'étonne pas de toi.
Linux Mint est à la base fait pour des utilisateurs plutôt néophytes et débutants, même si, comme cela s'avère être un très bon système, il est apprécié par des utilisateurs beaucoup plus avertis.
Pour utilisateurs débutants comme Ubuntu d'ailleurs, dont il est très largement dérivé, mais sans certaines tendances.
Lequel Ubuntu, soit dit au passage, n'est qu'un fork de Debian.
Un upgrade par réinstall propre, il n'y a certainement qu'une infime minorité d'utilisateurs de LM capables de le faire.
Ce n'est pas ton voisin qui le serait par exemple, puisque c'est toi qui le fait pour lui.
C'est bien la raison pour laquelle LM propose un outil graphique de mise à niveau.
Qui s'occupe de tout, comme le script d&c.
Ça peut foirer (une fois sur deux ça m'étonnerait fort), tout comme le script peut ne pas compiler.
C'est pourquoi avant de lancer l'upgrade, il faut prendre la précaution de sauvegarder ses données.
Maintenant des doubles ou triples boot sur des systèmes GNU/Linux, j'ai eu ça aussi.
J'utilisais toujours le même (comme toi tu sembles à plus de 90% sur LM), alors j'ai laissé tomber.
Et les partitions à part style /media/machin/truc, avec quelques liens qui vont bien dans le home, c'est bien pour un fin connaisseur comme toi.
Mais pour l'utilisateur encore néophyte, c'est encore plus compliqué que du chinois.

@ Patten

Bon courage pour de futures compilations, lorsque bien d'autres paquets, autres que osg, auront évolué.
Et une version en N° impair n'est pas plus instable qu'une version en N° pair, c'est simplement son support qui n'est pas assuré à long terme.
Vu que la prochaine version à N° pair le sera.
Mais ça le support à long terme c'est bien pour ceux qui font de la bureautique.
Pour FG une version ancienne c'est une autre histoire...


André. anciennement taureau89_9
Debian Testing Amd64. CM Sabertooth 990FX, FX8350, 32 Go Ram DDR3 1866 Mhz, GTX 750ti 2Go, DD 2To Sata 3, THRUSTMASTER T.Flight StickX, FG 2019.2.0 Git.

Hors ligne

#38 23/03/2019 12:12:30

dany93
Administrateur
Lieu : Région Parisienne
Inscription : 5/07/2009
Messages : 2 996

Re : Erreur compilation FGFS

Bonjour,

Petite question un peu annexe, plutôt pour comprendre.

Avant, pour avoir le défilement de l'arbre des propriétés par la molette souris, il fallait compiler PLIB.

Fin 2017, suite à un dysfonctionnement, j'ai compilé OSG (3.4) par d&c... et la molette ne faisait plus défiler malgré PLIB.

J'ai donc éliminé la compile d'OSG 3.4 et finalement refait fonctionner avec OSG 3.2. Molette incluse.

A ce jour, OSG 3.4 étant nécessaire, je l'ai compilé.
Avec PLIB en tête par précaution (c'est pas ce que ça coûte...).
Et la molette fonctionne, contrairement à mon expérience précédente (tant mieux !).

Ma question : PLIB est-il encore utile pour cette molette, ou est-ce que vous ne l'avez plus ?


FG 2019.2.0, Linux Mint 18 (64b), Quad Q6600 (2.4 GHz), RAM 8Go DDR2, GEFORCE GTX 650 1GB, OSG 3.4.2
Boeing 787-8 (YASim, avec nickyivyca, aco)
DR400 JSBSim (PAF)
DC3 JSBSim (PAF)

Hors ligne

#39 23/03/2019 12:25:35

f-toro
Administrateur
Lieu : LFLA
Inscription : 16/12/2007
Messages : 2 511

Re : Erreur compilation FGFS

A priori c'est bien Plib qu'il faut toujours compiler.
Chez moi la molette ne fonctionne pas.
Ce n'est pas pour si peu que je vais compiler Plib, je fais défiler par la souris et l'ascenseur.
Pour moi c'est un détail pas gênant.


André. anciennement taureau89_9
Debian Testing Amd64. CM Sabertooth 990FX, FX8350, 32 Go Ram DDR3 1866 Mhz, GTX 750ti 2Go, DD 2To Sata 3, THRUSTMASTER T.Flight StickX, FG 2019.2.0 Git.

Hors ligne

#40 23/03/2019 12:31:14

Clm76
Membre
Lieu : LFOH
Inscription : 22/10/2012
Messages : 1 043

Re : Erreur compilation FGFS

Bonjour à tous,

Sur mon portable de test, j'ai tenté "mintupgrade" pour passer de mint 18.3 à mint 19 (après lecture de la méthode sur les forums linux)... mais ça a foiré et ça n'a pas changé de version, avec en plus des blocages de souris et auttres.
Je me suis donc rabattu sur le téléchargement de la v19.1 et la création d'une clé usb de démarrage.
L'installation s'est passée sans problèmes.

Ensuite compilation de PLIB SIMGEAR FGFS dans un répertoire vide fg2019_2.
RAS, tout s'est passé sans erreurs. C'est f-toro qui va être content !... lol

J'ai tenté la copie de fgdata de ma machine normale vers le portable puis compilation de DATA mais ça n'a pas marché (erreurs dans des fichiers de ".git").
En dernier ressort, après suppression des fichiers de fgdata, recompilation de DATA mais qui s'est terminée en cours de route par la même erreur que f-toro de fin de fichier prématurée.
Je relance une nouvelle fois ...


Fg 2019.2.0 - LinuxMint 19.1 Tessa - CM Asus P8H67 MLE - CPU i3 2100T - 12 Go Ram - Nvidia Geforce GTX 770 - Driver Nvidia 384.130
+ Hp notebook-15-da0118nf -  CPU i3-7020u - Ram 4Go - Intel Graphics 620.

Hors ligne

#41 23/03/2019 12:50:54

ctesc356
Membre
Inscription : 18/05/2010
Messages : 2 715

Re : Erreur compilation FGFS

Bonjour,

@Clm76
pour récupérer un "fgdata" récalcitrant, obtenu par d&c ou "git clone", à faire sur une copie of course.

cd <dossier "fgdata">
git fetch origin
git reset --hard origin/next

@dany93
A ma connaissance osg n'a aucune influence sur la molette dans le gui, si on la veut il faut compiler plib avant sg et fgfs

@f-toro
Quand le ""néophyte" a sauvegardé ses données, il a fait le plus gros. L'installation à neuf prendra 20min tranquille, l'upgrade 20min aussi (ou +), mais quel stress...  demandes à Clm76 big_smile


Intel i5 3570 3.4Mhz, Nvidia GTX 660, 8Go Ram, Linux Mint

Hors ligne

#42 23/03/2019 12:54:45

f-toro
Administrateur
Lieu : LFLA
Inscription : 16/12/2007
Messages : 2 511

Re : Erreur compilation FGFS

@ Clm76 J'ai déjà relancé plusieurs fois.
Et pourtant l'adresse que j'ai semble la bonne :
https://git.code.sf.net/p/flightgear/fgdata
On fera aurement, par exemple comme suggère ctesc56.

Clm76 a écrit :

RAS, tout s'est passé sans erreurs. C'est f-toro qui va être content !... lol

Content oui.
Mais uniquement d'être en Debian testing (avec Xfce, c'est bien suffisant comme interface graphique, j'ai trouvé que Gnome devenait lourd et instable).
Je mets mon système à jour tous les jours, et ce, depuis plus de 10 ans.
J'ai toujours des paquets récents et peu de problèmes de compilation.
Lorsque j'en ai, c'est du à la nécessité d'ajouter de nouveaux paquets devenus nécessaires à la compilation de FG, alors que d&c ne les a pas encore inclus.


André. anciennement taureau89_9
Debian Testing Amd64. CM Sabertooth 990FX, FX8350, 32 Go Ram DDR3 1866 Mhz, GTX 750ti 2Go, DD 2To Sata 3, THRUSTMASTER T.Flight StickX, FG 2019.2.0 Git.

Hors ligne

#43 23/03/2019 12:56:48

f-toro
Administrateur
Lieu : LFLA
Inscription : 16/12/2007
Messages : 2 511

Re : Erreur compilation FGFS

ctesc356 a écrit :

L'installation à neuf prendra 20min

La plupart ne savent pas comment faire, vis à vis de leur installation d'origine.


André. anciennement taureau89_9
Debian Testing Amd64. CM Sabertooth 990FX, FX8350, 32 Go Ram DDR3 1866 Mhz, GTX 750ti 2Go, DD 2To Sata 3, THRUSTMASTER T.Flight StickX, FG 2019.2.0 Git.

Hors ligne

#44 23/03/2019 14:07:18

dany93
Administrateur
Lieu : Région Parisienne
Inscription : 5/07/2009
Messages : 2 996

Re : Erreur compilation FGFS

f-toro a écrit :

@ Clm76 J'ai déjà relancé plusieurs fois.
Et pourtant l'adresse que j'ai semble la bonne :
https://git.code.sf.net/p/flightgear/fgdata
On fera aurement, par exemple comme suggère ctesc56.

L'adresse est bonne (bien qu'elle n'existe plus sous cette forme dans la version actuelle de d&c).
Le problème (depuis assez longtemps) est que SourceForge gère mal les gros envois en https.

Remèdes :
- utiliser le protocole SSH (nécessite un compte sur SourceForge et une paire de clés).
- ce que tu écris (cf. ctesc356, copie et maj d'un ancien fgdata, la mise à jour fonctionne je crois, même en https).
- au pire, utiliser le protocole non sécurisé (que je n'ai pas essayé, source Florent Rougon)
(avec une version récente de d&c)

./download_and_compile.sh --git-clone-default-proto=git DATA

A faire en amont, DATA doit être à jour avant la compilation FlightGear.

Florent Rougon a écrit :

Depuis le nouveau système de traduction, il est fortement recommandé
d'avoir FGData à jour lorsqu'on compile FG, car les traductions Qt (pour
le launcher intégré) sont compilées dans le binaire fgfs à partir d'un
fichier présent dans FGData

Voir mon poème de tuto qui prend de plus en plus d'ampleur :

2 - De plus (souvent rapporté) l'importation des DATA (avec https par défaut)
plante systématiquement avant la fin du téléchargement (vers 50 - 60%, voire au début).
Dû à SourceForge qui a des difficultés à transmettre les gros fichiers avec le protocole https.

En espérant l'exactitude de ce que j'écris, je suis aussi en terrain glissant.


FG 2019.2.0, Linux Mint 18 (64b), Quad Q6600 (2.4 GHz), RAM 8Go DDR2, GEFORCE GTX 650 1GB, OSG 3.4.2
Boeing 787-8 (YASim, avec nickyivyca, aco)
DR400 JSBSim (PAF)
DC3 JSBSim (PAF)

Hors ligne

#45 23/03/2019 18:30:35

rominet
Membre
Inscription : 23/03/2019
Messages : 61

Re : Erreur compilation FGFS

Bonjour, quelques précisions :

dany93 a écrit :

Remèdes :
- utiliser le protocole SSH (nécessite un compte sur SourceForge et une paire de clés).

Pas tout à fait. La méthode avec une paire de clés SSH perso est la plus naturelle pour moi et elle est pratique quand on a l'habitude, c'est pourquoi je l'ai documentée en premier ici (en attendant que tout ça soit peut-être déplacé vers une page plus adaptée). Mais je me suis rendu compte en rédigeant que c'est long à expliquer à une audience pas forcément à l'aise avec SSH, même si au final c'est assez simple. Cela dit, j'ai pensé dans un second temps que l'on pouvait faire un peu plus simple (c'est surtout plus facile à expliquer), sans créer une paire de clés SSH. Ma recommandation serait donc la suivante :

- si vous connaissez déjà assez bien SSH ou avez envie d'apprendre des choses dessus et avez le temps de lire, essayez la méthode où vous utilisez une paire de clés SSH perso ;

- sinon, lisez les sections Vocabulaire technique français/anglais et Motivation, puis passez directement à Autre méthode : clonage avec SSH et mises à jour avec HTTPS : on clone via le protocole ssh avec un mot de passe (il faut donc un compte sur SourceForge) puis on met à jour avec le protocole https. A priori, les mises à jour en https devraient toujours passer, sauf si vous n'en avez pas fait depuis 10 ans et que ça revient à quasiment tout télécharger.

Le tutoriel que j'ai écrit (liens ci-dessus) est sur le wiki FG. La license est donc libre et si des passages ne sont pas clairs, on peut les modifier.

dany93 a écrit :

- ce que tu écris (cf. ctesc356, copie et maj d'un ancien fgdata, la mise à jour fonctionne je crois, même en https).

Oui, voir ci-dessus. smile


Debian GNU/Linux, driver libre pour carte Radeon HD 4670, FG 'next', 8 Go de RAM

Hors ligne

#46 24/03/2019 12:57:54

Clm76
Membre
Lieu : LFOH
Inscription : 22/10/2012
Messages : 1 043

Re : Erreur compilation FGFS

Bonjour,

Suite de mes essais :

./download_and_compile.sh --git-clone-default-proto=git DATA

Fonctionne très bien. Le DATA a été entièrement chargé sans interruption (très long mais ça le fait).

Essais du CitationX par le lanceur intégré. Ok pour le lancement mais des erreurs Canvas.
Rechargement normal du DATA par

./download.and.compile.sh -j4 DATA

Plus d'erreurs Canvas. Tout est ok.

A noter que je n'ai pas eu besoin de recharger FGFS pour que le lanceur fonctionne.


Fg 2019.2.0 - LinuxMint 19.1 Tessa - CM Asus P8H67 MLE - CPU i3 2100T - 12 Go Ram - Nvidia Geforce GTX 770 - Driver Nvidia 384.130
+ Hp notebook-15-da0118nf -  CPU i3-7020u - Ram 4Go - Intel Graphics 620.

Hors ligne

#47 24/03/2019 13:38:41

dany93
Administrateur
Lieu : Région Parisienne
Inscription : 5/07/2009
Messages : 2 996

Re : Erreur compilation FGFS

Clm76 a écrit :

A noter que je n'ai pas eu besoin de recharger FGFS pour que le lanceur fonctionne.

Bonjour Christian,

Merci du retour.

Par contre (si ta signature est à jour), je me serais attendu à un désaccord de versions entre fgfs 2018.4 et les DATA.


FG 2019.2.0, Linux Mint 18 (64b), Quad Q6600 (2.4 GHz), RAM 8Go DDR2, GEFORCE GTX 650 1GB, OSG 3.4.2
Boeing 787-8 (YASim, avec nickyivyca, aco)
DR400 JSBSim (PAF)
DC3 JSBSim (PAF)

Hors ligne

#48 24/03/2019 14:08:41

rominet
Membre
Inscription : 23/03/2019
Messages : 61

Re : Erreur compilation FGFS

Clm76 a écrit :

Suite de mes essais :

./download_and_compile.sh --git-clone-default-proto=git DATA

Fonctionne très bien. Le DATA a été entièrement chargé sans interruption (très long mais ça le fait).

Moui, avec le protocole git, bon... Au moins, tu peux modifier le .git/config dans ton dépôt fgdata pour mettre https:// à la place de git:// (similaire à ces instructions où l'on passe de ssh à https). Ainsi, les futures mises à jour se feront via https.

./download.and.compile.sh -j4 DATA

Les mises à jour utilisent le protocole renseigné dans le .git/config du dépôt. Comme tu as cloné avec le protocole git, cette mise à jour s'est faite avec le même protocole.

Clm76 a écrit :

A noter que je n'ai pas eu besoin de recharger FGFS pour que le lanceur fonctionne

Normal, seules les traductions du launcher intégré nécessitent FGData à la compil. de FG (tu dois d'ailleurs avoir un message CMake indiquant qu'elles n'ont pas été trouvées). Comme le lanceur n'est pas encore traduit en français, tu as peu de chances de voir la différence... Mais si tu essaies de le lancer en italien ou en néerlandais (p. ex., 'fgfs --launcher --language=it', ou bien utiliser les locales), ça devrait coincer tant que tu n'as pas recompilé FG avec FGData au bon endroit.


Debian GNU/Linux, driver libre pour carte Radeon HD 4670, FG 'next', 8 Go de RAM

Hors ligne

#49 24/03/2019 18:41:57

Clm76
Membre
Lieu : LFOH
Inscription : 22/10/2012
Messages : 1 043

Re : Erreur compilation FGFS

dany93 a écrit :

Par contre (si ta signature est à jour), je me serais attendu à un désaccord de versions entre fgfs 2018.4 et les DATA.

Elle est maintenant à jour.

rominet a écrit :

Moui, avec le protocole git, bon... Au moins, tu peux modifier le .git/config dans ton dépôt fgdata pour mettre https:// à la place de git:// (similaire à ces instructions où l'on passe de ssh à https). Ainsi, les futures mises à jour se feront via https.

Comme j'ai un compte sourceforge, la prochaine fois j'essaierai le clonage avec mon mot de passe.

rominet a écrit :

Normal, seules les traductions du launcher intégré nécessitent FGData à la compil. de FG (tu dois d'ailleurs avoir un message CMake indiquant qu'elles n'ont pas été trouvées)

Voici le log de la console au démarrage du lanceur :

    0.13 [INFO]:general    FlightGear:  Version 2019.2.0
    0.13 [INFO]:general    FlightGear:  Build Type Dev
    0.13 [INFO]:general    Built with GNU C++ version 7.3
    0.13 [INFO]:general    Jenkins number/ID 0:none
    3.04 [WARN]:gui        Failed to load default (en) translations
    3.19 [INFO]:navaid     NavCache at:Path "/home/clm/.fgfs/navdata_2019_2.cache"
    3.19 [INFO]:navaid     NavCache read-only flags is:0
    3.44 [INFO]:navaid     NavCache: no main cache rebuild required
    3.44 [INFO]:general    init package root at:Path "/home/clm/fg/TerraSync/Aircraft"

Fg 2019.2.0 - LinuxMint 19.1 Tessa - CM Asus P8H67 MLE - CPU i3 2100T - 12 Go Ram - Nvidia Geforce GTX 770 - Driver Nvidia 384.130
+ Hp notebook-15-da0118nf -  CPU i3-7020u - Ram 4Go - Intel Graphics 620.

Hors ligne

#50 24/03/2019 19:51:57

rominet
Membre
Inscription : 23/03/2019
Messages : 61

Re : Erreur compilation FGFS

Clm76 a écrit :
    3.04 [WARN]:gui        Failed to load default (en) translations

Cela m'a l'air normal si FGData n'était pas à l'endroit attendu lorsque FG a été compilé. Ce message est affiché lorsque le launcher intégré essaie de charger FlightGear_en.qm (traduction par défaut), qui est normalement embarqué dans le binaire fgfs. Or ce fichier FlightGear_en.qm est produit au moyen de l'outil Qt 'lrelease' à partir de fgdata/Translations/en_US/FlightGear-Qt.xlf lors de la compil. de FG (et est écrit dans la racine du répertoire de build de FG avant d'être embarqué dans l'exécutable fgfs), d'où la nécessité d'avoir FGData au moment de la compil. de FG si l'on veut avoir les traductions du launcher intégré.

Dans compilation_log.txt, tu as sans doute eu un message du genre :

-- Couldn't find translations data, will not include translated string in the executable

Debian GNU/Linux, driver libre pour carte Radeon HD 4670, FG 'next', 8 Go de RAM

Hors ligne

Pied de page des forums